program: Gaussian 09
title: 000185430
version: EM64L-G09RevD.01
frameworkgroup: C1[X(C14H19N4O2)]
method: RPBEPBE
basis: SDD
operation: Freq
keyword: #p
keyword: freq=noraman
keyword: PBEPBE/SDD
title: #p freq=noraman PBEPBE/SDD
converged: YES YES NO NO
title: Mulliken charges:
elementType: O O N N N N C C C C C C C C C C C C C C H H H H H H H H H H H H H H H H H H H
charge: -0.156101 -0.272936 -0.161445 -0.205195 -0.065203 0.049748 -0.435461 -0.408928 0.356642 0.367258 -0.438297 -0.442015 0.461686 0.258579 0.351037 -0.768256 -0.784089 -0.337504 -0.773195 -0.754143 0.316137 0.268791 0.289578 0.238074 0.273060 0.270335 0.299209 0.269467 0.263014 0.271722 0.252469 0.275464 0.309256 0.253079 0.255026 0.272527 0.248177 0.225513 0.306919
chargesum: 1.00000
title: Mulliken charges with hydrogens summed into heavy atoms:
elementType: O O N N N N C C C C C C C C C C C C C C
charge: -0.156101 -0.272936 -0.161445 -0.205195 -0.065203 0.049748 0.149467 0.118725 0.356642 0.367258 -0.165237 -0.171679 0.461686 0.258579 0.351037 0.063433 0.015566 -0.028248 0.007437 0.026466
polarizability: 2.62742956e+02 3.95251605e-01 2.18143758e+02 1.61811291e+01 1.25693524e+00 1.02122898e+02
1716.lowfreq: -5.1997 -0.0006 -0.0005 -0.0001 2.5771 5.3000 16.3585 23.0621 37.5059
frequency: 16.2562 23.0311 37.4923 57.0370 69.2688 92.2255 113.0437 130.9522 150.6301 166.0360 170.7479 176.6547 195.9405 211.7558 214.7605 271.3489 278.3323 297.8040 319.7717 340.7936 372.7451 390.1658 402.0671 416.5927 489.5443 501.8958 537.1740 541.8075 557.2319 559.4161 572.5274 591.0361 659.2032 670.1439 688.8350 720.7740 733.1241 755.5383 786.3869 816.0053 872.0335 886.1060 906.9937 915.4464 933.0317 963.9222 974.4774 1014.8174 1018.9299 1025.5089 1037.3675 1040.4744 1042.7497 1044.8367 1050.7722 1099.8414 1132.0476 1136.9985 1167.5017 1194.4972 1202.4571 1219.2761 1258.7669 1286.4157 1307.3275 1317.9376 1335.8438 1338.6506 1341.8042 1351.5986 1380.2966 1399.1504 1400.8954 1403.6131 1404.9354 1413.7674 1422.8189 1424.9493 1449.6699 1459.9889 1466.1751 1469.7593 1470.4597 1472.2648 1472.9303 1476.2542 1485.7875 1489.5564 1491.1993 1522.2906 1563.8583 1636.8955 2983.6708 2987.3909 2995.2355 2995.6323 3047.6361 3060.8692 3073.8630 3076.0026 3079.9212 3082.2117 3107.8261 3113.4771 3121.6014 3125.5132 3125.9785 3141.3534 3173.4761 3175.8386 3251.4155
redmass: 1.0282 4.1547 4.3168 7.1567 4.8108 4.1645 4.4513 3.5359 1.6269 1.6475 1.9026 1.5961 1.5289 1.6600 4.7955 5.7216 2.5400 3.7898 2.2574 2.8057 4.5441 4.0048 2.8110 5.9022 4.7559 2.9811 3.0864 3.8005 3.7233 3.6512 4.2288 4.7458 4.8802 5.0487 8.5473 3.5759 4.6281 7.1186 1.4939 3.0794 1.2406 1.4409 3.2179 1.2810 2.9507 3.4577 1.6535 3.3625 1.5975 1.7058 1.4342 1.6313 1.5278 1.6440 1.6489 2.9741 3.1313 5.2780 2.5391 1.6193 1.9995 3.7399 2.1384 1.3259 4.0673 1.6254 3.2481 2.5419 3.4093 2.1054 1.8058 1.3611 1.1874 1.5419 1.4963 1.3453 1.7986 1.5522 1.2850 1.1579 2.4821 1.1664 1.2299 1.1129 1.1432 1.1749 1.3234 1.4615 2.5676 1.1219 5.9058 5.8980 1.0400 1.0420 1.0421 1.0440 1.0598 1.0979 1.0912 1.0625 1.0918 1.0904 1.1033 1.1012 1.0981 1.0956 1.0996 1.1066 1.0932 1.0945 1.1002
irintensity: 0.9850 0.5332 0.0950 0.7795 1.8878 0.4617 2.3266 5.1710 1.1830 0.8220 4.6251 2.1418 1.0154 0.1163 4.9077 3.7804 0.7324 4.2032 2.5897 1.6242 1.8423 10.9868 0.3965 0.7822 3.9415 0.2013 0.1074 3.3334 2.0425 4.2457 0.8167 1.4623 7.8270 5.2028 8.0638 1.6395 2.4880 13.9648 3.1140 2.5174 16.1350 20.2016 2.8697 0.2331 0.5880 0.0761 3.5163 3.0626 0.7499 8.9848 1.6771 5.2513 3.1728 26.6665 4.7710 15.5109 25.1960 30.1471 167.5217 1.0567 27.5177 7.2595 19.7473 7.0524 93.9670 14.7305 173.6962 11.1411 143.5958 54.8822 36.0248 28.7687 54.7641 19.6647 41.5999 51.0659 6.1350 16.3783 6.7984 13.4259 117.3620 23.1749 48.3597 45.5340 11.0284 14.5436 42.5911 56.3459 31.3324 20.7998 75.9554 177.6320 18.1457 0.9026 1.7932 4.8764 12.4223 14.7518 6.9353 7.7689 4.8107 12.2627 2.4687 4.8810 4.2756 0.9989 3.8585 2.9282 0.2995 0.1014 9.7095
temp: 298.150 k
press: 1.00000 atm
elementType: 8 8 7 7 7 7 6 6 6 6 6 6 6 6 6 6 6 6 6 6 1 1 1 1 1 1 1 1 1 1 1 1 1 1 1 1 1 1 1
symmnumber: 1
zpe: 833862.7 jmol-1
zpe.correction: 0.317602 hartree
zpe.thermalcorrener: 0.337655 hartree
zpe.thermalcorrenthalpy: 0.338599 hartree
zpe.thermalcorrgfe: 0.267122 hartree
zpe.sumelectzpe: -912.552271 hartree
zpe.sumelectthermal: -912.532218 hartree
zpe.sumelectthermalent: -912.531274 hartree
zpe.sumelectthermalfe: -912.602751 hartree
dipole: -11.9047 3.9275 0.0427
dipole: 12.5359
quadrupole: -69.7882 -103.5696 -112.4473
quadrupole: 5.9140 0.1635 1.5712
quadrupole: 25.4802 -8.3013 -17.1789 5.9140 0.1635 1.5712
hfenergy: -912.8698729 hartree
pointgroup: C01 [X(C14H19N4O2)]
dipole: -4.6923766 1.5041656 -0.2091812 debye
polarizability: 261.9133534|2.196514|217.6555408|19.7141945|-7.6585509|103.4407168 unknown
InChI: InChI=1S/C14H19N4O2/c1-10-7-11(2)16(12(3)8-10)5-6-17-13(4)15-9-14(17)18(19)20/h7-9H,5-6H2,1-4H3
charge 1 multiplicity 1
39 atoms
O  3.925021 -2.511514 0.583268
O  1.680079 -2.253492 0.20457
N  -1.635116 0.015829 0.406678
N  2.101662 0.546809 -0.260718
N  4.072753 1.674023 -0.029528
N  2.9024 -1.783758 0.308072
C  -0.168771 0.100159 0.716149
C  0.6813 0.30379 -0.574811
C  -2.212237 -1.230247 0.140037
C  -2.395641 1.188462 0.366775
C  -3.573989 -1.284521 -0.205703
C  -3.753423 1.111048 0.023691
C  -4.381611 -0.124223 -0.277911
C  2.75232 1.787049 -0.339665
C  3.102903 -0.385104 0.114002
C  -1.399476 -2.491798 0.260271
C  -1.768654 2.513394 0.726882
C  4.297859 0.338283 0.24958
C  -5.845648 -0.200063 -0.62524
C  2.104059 3.072274 -0.746072
H  0.149279 -0.83225 1.201859
H  -0.001557 0.931988 1.416055
H  0.59961 -0.586834 -1.216571
H  0.317904 1.177273 -1.141586
H  -4.006391 -2.266375 -0.415024
H  -4.330373 2.039195 -0.002916
H  -0.458454 -2.475705 -0.312441
H  -1.119069 -2.694847 1.311903
H  -1.997886 -3.345912 -0.089521
H  -1.478715 2.551698 1.794081
H  -0.873427 2.746761 0.125817
H  -2.49718 3.320321 0.558443
H  5.275129 -0.045662 0.531035
H  -6.196867 0.717157 -1.126173
H  -6.069545 -1.064106 -1.272043
H  -6.449349 -0.318389 0.296183
H  1.678428 3.028507 -1.765944
H  1.307843 3.389878 -0.046828
H  2.882335 3.849901 -0.739656
