program: Gaussian 09
title: 000185426
version: EM64L-G09RevD.01
frameworkgroup: C1[X(C12H14N5O3)]
method: RPBEPBE
basis: SDD
operation: Freq
keyword: #p
keyword: freq=noraman
keyword: PBEPBE/SDD
title: #p freq=noraman PBEPBE/SDD
converged: YES YES NO NO
title: Mulliken charges:
elementType: O O O N N N N N C C C C C C C C C C C C H H H H H H H H H H H H H H
charge: -0.150220 -0.299167 -0.241263 -0.213451 -0.061443 -0.060293 0.049663 -0.616188 -0.408118 -0.404660 0.261578 0.347372 -0.239113 -0.130139 -0.327579 -0.745379 0.249297 -0.193692 -0.216435 0.209413 0.302452 0.257263 0.304925 0.259713 0.333192 0.362236 0.309093 0.254465 0.234051 0.303858 0.285965 0.266053 0.337333 0.379216
chargesum: 1.00000
title: Mulliken charges with hydrogens summed into heavy atoms:
elementType: O O O N N N N N C C C C C C C C C C C C
charge: -0.150220 -0.299167 -0.241263 -0.213451 -0.061443 -0.060293 0.049663 0.100362 0.151597 0.159979 0.261578 0.347372 0.094079 0.232096 -0.018486 0.046996 0.249297 0.092273 0.049618 0.209413
polarizability: 2.54351124e+02 2.16716386e+00 2.09318037e+02 1.34537035e+01 5.34061518e+00 8.24469990e+01
1716.lowfreq: -4.4204 0.0007 0.0007 0.0008 4.2366 7.0874 21.1383 32.3765 45.5859
frequency: 21.0906 32.3661 45.5821 54.0471 62.9679 99.6501 109.9793 113.0097 133.9315 157.1860 200.8467 206.2069 234.4222 273.9834 307.9394 328.9035 355.3417 372.7972 389.4226 408.2421 416.9717 455.3763 487.2287 521.6281 539.9922 578.9295 590.4728 596.8282 651.1062 662.7310 671.0891 688.0975 693.5851 713.9044 731.5535 749.0135 773.7232 802.2634 838.8397 884.6005 896.2687 921.3627 952.8458 970.4314 971.3206 1008.2956 1014.2700 1019.2914 1042.9612 1054.8286 1070.9506 1113.7173 1122.5000 1132.0684 1167.5813 1182.7761 1205.3359 1216.3709 1225.8255 1262.8348 1306.4904 1316.3050 1335.0195 1340.6893 1348.7169 1365.1982 1378.7154 1383.6602 1401.7885 1407.4457 1442.2118 1448.3552 1461.9941 1470.5688 1475.6862 1476.3539 1488.5502 1491.1799 1567.7566 1585.7667 1626.9209 1658.1220 2987.1955 3045.8186 3058.8638 3063.9920 3106.5861 3128.8130 3134.0042 3164.4316 3169.3531 3173.1773 3199.2402 3249.6474 3516.9051 3662.1798
redmass: 6.7577 4.9428 5.5664 8.5429 4.9357 4.2961 5.7278 1.0763 5.4907 4.4989 4.0916 5.3637 5.0118 4.8647 2.9123 2.9159 4.0474 4.6521 4.1558 2.7577 6.1765 1.8179 3.4065 2.0651 4.2471 5.1395 4.4184 4.4287 2.4585 2.1072 4.1764 8.2756 2.4379 5.1506 2.9651 6.0698 2.8336 2.0546 1.5444 1.4447 4.0564 3.4314 1.4954 1.3954 1.6640 1.7362 3.1374 3.9635 1.5377 1.8812 2.2692 2.6676 1.9607 2.2032 2.6009 4.0808 1.3092 1.6169 2.5217 1.8604 4.4192 1.3752 1.3374 3.5510 2.0949 3.5609 3.4478 1.9131 1.2967 2.0696 1.5275 1.3327 4.1555 1.0785 2.1204 1.3655 2.8869 1.4719 4.3630 2.8941 2.9901 2.2990 1.0402 1.0599 1.0603 1.0979 1.1047 1.0961 1.1079 1.0922 1.0958 1.0969 1.0992 1.1002 1.0471 1.1033
irintensity: 7.2718 12.6413 5.3743 1.1912 2.7924 0.7775 1.3648 0.6273 5.0184 2.1344 9.3964 12.7577 0.7918 3.8541 6.2449 2.2709 6.1318 3.9789 6.2372 1.6554 1.0409 36.2890 1.9510 30.1674 6.8208 11.4219 12.5483 1.8386 64.4632 106.4920 0.7585 8.5612 8.3433 3.6475 132.0685 11.6616 1.4669 8.6492 34.5999 19.7156 0.7999 3.7809 6.4785 4.5714 5.1395 0.8715 0.3818 7.3327 5.1643 1.3227 10.7753 38.9917 19.8317 39.1262 186.6290 46.9354 15.8717 11.7352 14.1595 14.3557 152.5304 1.7212 41.9530 318.9031 21.3673 111.5199 40.9483 56.0649 24.7151 48.0727 2.7984 26.4992 197.8737 29.4410 7.4748 12.8276 38.3150 24.4641 11.7953 44.4212 7.2013 309.1443 7.7586 10.4495 4.5880 9.3627 0.4948 0.4777 0.8956 18.2145 81.1869 14.4810 6.7538 9.9990 118.4879 50.5241
temp: 298.150 k
press: 1.00000 atm
elementType: 8 8 8 7 7 7 7 7 6 6 6 6 6 6 6 6 6 6 6 6 1 1 1 1 1 1 1 1 1 1 1 1 1 1
symmnumber: 1
zpe: 687526.1 jmol-1
zpe.correction: 0.261865 hartree
zpe.thermalcorrener: 0.280229 hartree
zpe.thermalcorrenthalpy: 0.281173 hartree
zpe.thermalcorrgfe: 0.213111 hartree
zpe.sumelectzpe: -963.334887 hartree
zpe.sumelectthermal: -963.316523 hartree
zpe.sumelectthermalent: -963.315579 hartree
zpe.sumelectthermalfe: -963.383642 hartree
dipole: -10.8768 -1.0738 -0.1690
dipole: 10.9310
quadrupole: -51.6715 -107.8485 -112.0041
quadrupole: 26.6801 1.9756 0.3145
quadrupole: 38.8365 -17.3404 -21.4961 26.6801 1.9756 0.3145
hfenergy: -963.5967521 hartree
pointgroup: C01 [X(C12H14N5O3)]
dipole: -4.2919417 0.2606531 -0.0792797 debye
polarizability: 255.0482177|-1.779091|208.4861082|-8.9310541|-10.7892654|82.5818338 unknown
InChI: InChI=1S/C12H14N5O3/c1-9-14-7-11(17(19)20)16(9)6-5-15-4-2-3-10(8-15)12(13)18/h2-4,7-8H,5-6,13H2,1H3
charge 1 multiplicity 1
34 atoms
O  3.898809 2.619278 -0.365847
O  1.681557 2.077719 -0.161551
O  -4.325663 -2.383294 0.015873
N  2.406866 -0.65637 0.286096
N  -1.188234 0.188891 -0.542188
N  4.493465 -1.557359 0.11262
N  2.961724 1.761233 -0.184404
N  -5.958675 -0.728935 -0.041329
C  0.961867 -0.557266 0.539095
C  0.170055 -0.400844 -0.794587
C  3.17876 -1.822921 0.355388
C  3.315326 0.393014 -0.010554
C  -2.27925 -0.631852 -0.436981
C  -1.306171 1.557833 -0.389222
C  4.587428 -0.196098 -0.108589
C  2.640294 -3.178988 0.680331
C  -3.563119 -0.111325 -0.185674
C  -2.563245 2.120165 -0.134768
C  -3.704377 1.289471 -0.034299
C  -4.657865 -1.16302 -0.062778
H  0.770801 0.316318 1.181391
H  0.646252 -1.467021 1.075731
H  0.710663 0.287471 -1.460314
H  0.035435 -1.368358 -1.304363
H  -2.145288 -1.712671 -0.542364
H  -0.383941 2.140097 -0.468927
H  5.530568 0.297029 -0.331037
H  2.245381 -3.235955 1.712142
H  1.840597 -3.499918 -0.012318
H  3.469845 -3.896861 0.599263
H  -2.639447 3.203419 -0.016812
H  -4.675595 1.747665 0.176959
H  -6.244901 0.240221 -0.16843
H  -6.691618 -1.434765 0.053949
