program: Gaussian 09
title: 000185406
version: EM64L-G09RevD.01
frameworkgroup: C1[X(C6H14N2O2)]
method: RPBEPBE
basis: SDD
operation: Freq
keyword: #p
keyword: freq=noraman
keyword: PBEPBE/SDD
title: #p freq=noraman PBEPBE/SDD
converged: NO YES NO NO
title: Mulliken charges:
elementType: O O N N C C C C C C H H H H H H H H H H H H H H
charge: -0.461412 -0.288476 -0.045181 0.038517 -0.023615 -0.406021 -0.363733 -0.394378 -0.681354 -0.652302 0.220919 0.197188 0.227473 0.221222 0.243524 0.209284 0.190146 0.213792 0.217119 0.229904 0.327884 0.255093 0.253122 0.271285
chargesum: 0.00000
title: Mulliken charges with hydrogens summed into heavy atoms:
elementType: O O N N C C C C C C
charge: -0.133529 -0.288476 -0.045181 0.038517 0.197304 0.018639 0.101013 0.005053 -0.020539 0.127198
polarizability: 1.04425193e+02 -6.21083590e+00 8.19108205e+01 -8.81927034e+00 7.03043397e-01 7.85626273e+01
1716.lowfreq: -10.8636 -0.0010 -0.0003 0.0006 2.3509 19.3475 34.5597 70.8205 82.3530
frequency: 34.3861 70.7725 82.3245 113.0762 145.5606 164.3551 196.3691 209.1597 246.8487 293.9901 315.2479 322.0996 378.2068 397.4773 442.6622 460.2865 526.5643 642.4670 748.2638 779.5964 803.6203 888.8214 924.8324 933.5609 985.4073 1014.3778 1052.2955 1059.9005 1090.2825 1104.7338 1118.7830 1141.7523 1184.6980 1228.4722 1271.2089 1274.5484 1296.0643 1315.4193 1334.9548 1346.2992 1355.5977 1369.3576 1370.7810 1391.4906 1425.0612 1443.0900 1450.9010 1461.9548 1464.4583 1473.1313 1480.6541 1487.1038 2953.4514 2967.2167 2984.2409 2988.0975 3015.5947 3020.0928 3032.5021 3052.1946 3066.6973 3078.5150 3088.4585 3089.2609 3131.8233 3538.5794
redmass: 5.3964 3.2416 2.8391 2.6614 2.2932 2.0723 1.3306 1.4753 3.4406 3.2932 1.0808 3.6515 2.5245 3.8828 2.3266 2.4109 3.0309 3.5946 2.2032 1.3720 4.0774 2.1637 1.7657 3.1356 2.2694 1.8334 1.4019 2.4988 1.8067 1.3503 2.5474 1.8014 1.5928 1.3396 1.4976 3.1979 1.6702 1.4116 2.0520 1.6881 1.3644 1.4323 1.1901 1.2112 1.1458 1.0915 1.1085 1.0781 1.0491 1.0417 1.0665 1.0564 1.0636 1.0626 1.0363 1.0340 1.0936 1.0645 1.0870 1.0937 1.0990 1.0996 1.1037 1.1009 1.1026 1.0658
irintensity: 4.8944 3.8909 2.2051 0.2270 2.0676 2.2229 1.4574 2.9450 1.5327 11.2737 130.6218 11.3874 3.0217 2.5506 17.7512 15.6968 4.1978 0.3785 1.0172 2.1859 15.7545 91.7655 9.8160 16.7137 41.7176 61.1532 40.2819 7.2937 10.4646 0.1575 15.8347 26.4553 13.6920 7.9981 55.0250 3.5668 71.9807 5.5672 34.0842 2.8445 9.3597 3.7681 20.3607 13.9235 25.5422 5.9715 18.9678 8.9238 15.1652 12.2126 24.1757 12.3616 23.3932 38.5481 29.5798 15.9242 14.5786 19.4588 6.0961 50.8792 23.7428 55.1384 2.9000 39.5645 0.6066 3.1965
temp: 298.150 k
press: 1.00000 atm
elementType: 8 8 7 7 6 6 6 6 6 6 1 1 1 1 1 1 1 1 1 1 1 1 1 1
symmnumber: 1
zpe: 533056.3 jmol-1
zpe.correction: 0.203030 hartree
zpe.thermalcorrener: 0.215426 hartree
zpe.thermalcorrenthalpy: 0.216370 hartree
zpe.thermalcorrgfe: 0.164155 hartree
zpe.sumelectzpe: -496.082320 hartree
zpe.sumelectthermal: -496.069925 hartree
zpe.sumelectthermalent: -496.068981 hartree
zpe.sumelectthermalfe: -496.121196 hartree
dipole: -4.9778 1.9932 1.8959
dipole: 5.6873
quadrupole: -75.4478 -59.4842 -62.3889
quadrupole: -1.4520 8.4383 2.0079
quadrupole: -9.6742 6.2894 3.3847 -1.4520 8.4383 2.0079
hfenergy: -496.2853509 hartree
pointgroup: C01 [X(C6H14N2O2)]
dipole: 1.993628 0.8987362 0.4737626 debye
dipolederiv: -0.6084008 0.076698 0.2341627 0.1082842 -0.6856164 0.1919453 0.2904771 0.175858 -0.3740393 -0.8117916 -0.3704566 0.0072412 -0.3667611 -0.4531452 0.0338977 -0.6155335 -0.3836303 -0.3384279 -0.7688038 -0.2679814 -0.1231593 -0.3571595 -0.4510717 -0.0977953 0.1563316 0.130734 -0.1564051 0.98095 0.723929 0.0208472 0.8278862 0.4600511 -0.0020793 0.1678921 0.1346608 -0.0648478 0.4098078 0.0432364 -0.1013735 0.0201432 0.5603055 -0.1149632 -0.1370827 -0.1254868 0.2800587 -0.0761638 0.0400296 0.0849188 0.0779655 -0.0112707 -0.0079339 0.0531963 0.0329913 0.0072158 0.3940235 0.0218891 0.1806303 0.0398808 0.2583524 0.0914694 0.3088247 0.1033099 0.2436933 -0.0295942 0.1030822 0.0218264 0.0326219 0.0751826 0.0432997 0.0607939 0.0589222 0.0714218 -0.0222473 0.024356 0.0683071 0.0456953 0.0514259 -0.0165026 0.0356151 0.0088333 -0.0073227 0.1208845 -0.0756826 -0.0099192 -0.1353223 0.1210155 -0.0043628 0.056706 0.0148711 0.1251201 0.0353512 -0.0555419 -0.0574361 -0.074157 -0.0303157 -0.0346432 -0.0765527 -0.0520892 -0.0673964 -0.076001 -0.0778034 -0.1365628 -0.0445933 0.0362674 -0.0966437 -0.0818515 -0.0706786 -0.0559441 0.0533202 -0.033073 0.0339683 0.0004664 -0.1047884 0.0727301 0.0225654 0.0498668 0.058572 0.0495464 -0.0517204 -0.0537505 -0.0207971 -0.1023687 0.0089376 -0.0874451 0.0707229 0.0679647 -0.021421 0.0302377 0.085749 0.0004736 0.1006893 0.0164239 0.0233648 -0.0473665 -0.0760716 0.0541578 -0.0368551 0.0486855 -0.0211366 -0.0982267 0.1158719 0.0405419 0.0941521 -0.005368 -0.0106826 -0.0245911 -0.0536794 -0.0742497 -0.0400409 -0.140584 -0.0614276 -0.1094323 -0.0655644 0.0269859 -0.1030942 -0.0832085 -0.0683814 -0.0109155 -0.1056956 -0.0312094 -0.0943789 -0.0188337 -0.1722985 0.1049359 -0.0068538 0.1104037 0.0612925 0.0010491 -0.0331164 0.0131883 0.063281 0.1161386 -0.0190241 0.0059798 -0.0637412 -0.0684023 0.1193934 0.0325511 0.0703168 0.0184084 0.2411095 -0.0951202 -0.1419423 -0.0557756 0.2711968 -0.0239508 -0.214462 -0.097086 0.1301521 -0.067949 0.1118924 -0.0735718 0.0562799 0.0376785 0.0395006 0.0179603 0.0398815 0.0433893 0.0954441 0.0048122 0.0076389 0.039373 -0.0452635 -0.1041867 0.0407241 -0.0172919 0.0100378 0.0876344 -0.0741546 0.041502 -0.0773988 0.0679683 0.0148222 0.0311365 -0.0008683 0.1109058 unknown
polarizability: 104.9097292|9.9574969|78.9619801|2.6261018|0.8002828|81.0269316 unknown
InChI: InChI=1S/C6H14N2O2/c1-3-6(9)4-5-8(2)7-10/h6,9H,3-5H2,1-2H3
charge 0 multiplicity 1
24 atoms
O  1.406742 1.486232 -0.533989
O  -3.590947 -0.947096 -0.246546
N  -1.84795 0.394644 0.176743
N  -2.804064 -0.473748 0.66229
C  1.253278 0.136925 0.068999
C  0.392835 0.201135 1.349809
C  -0.940799 0.970224 1.189918
C  2.625204 -0.525789 0.31499
C  3.430579 -0.75391 -0.980416
C  -1.788524 0.751326 -1.2562
H  0.714349 -0.424055 -0.715319
H  0.973796 0.690849 2.160146
H  0.174441 -0.831022 1.686059
H  -0.734979 2.017597 0.907471
H  -1.485939 0.961117 2.149604
H  2.461708 -1.492072 0.832535
H  3.205783 0.107501 1.020695
H  2.915485 -1.473639 -1.643413
H  4.435999 -1.156063 -0.760784
H  3.547931 0.190883 -1.539991
H  2.011557 2.019517 0.044142
H  -2.711748 1.282354 -1.553521
H  -1.728354 -0.163568 -1.872456
H  -0.90528 1.385561 -1.422068
