program: Gaussian 09
title: 000185397
version: EM64L-G09RevD.01
frameworkgroup: C1[X(C11H12O5)]
method: RPBEPBE
basis: SDD
operation: Freq
keyword: #pfreq=noraman
keyword: PBEPBE/SDD
title: #p freq=noraman PBEPBE/SDD
converged: YES YES NO NO
title: Mulliken charges:
elementType: O O O O O C C C C C C C C C C C H H H H H H H H H H H H
charge: -0.270582 -0.230435 -0.293019 -0.247519 -0.249360 0.134193 0.263674 -0.311938 -0.353015 -0.233677 -0.199250 0.207595 -0.262106 0.309787 -0.665010 -0.499956 0.278520 0.261337 0.235703 0.237326 0.238053 0.229228 0.218175 0.230405 0.251283 0.244957 0.243320 0.232309
chargesum: 0.00000
title: Mulliken charges with hydrogens summed into heavy atoms:
elementType: O O O O O C C C C C C C C C C C
charge: -0.270582 -0.230435 -0.293019 -0.247519 -0.249360 0.134193 0.263674 -0.033418 -0.091678 0.002026 0.038076 0.207595 0.205175 0.309787 0.034853 0.220631
polarizability: 1.72091063e+02 -1.28833825e+01 1.58504601e+02 1.37498972e+01 2.09815501e+00 8.16022179e+01
1716.lowfreq: -12.4875 -5.5310 -0.0004 0.0010 0.0012 3.7690 20.0505 31.3652 52.3696
frequency: 19.1880 31.2100 52.2490 73.7576 91.5287 98.7172 101.1517 140.9154 165.9133 172.5645 199.1582 258.9387 267.4524 286.3787 309.1671 335.6677 394.7831 436.1898 440.7006 484.6689 515.2140 603.6018 639.1455 647.1976 666.9791 679.2244 752.6085 759.3834 781.2474 794.1342 803.2696 828.3468 888.2878 919.5840 940.5478 971.7863 999.2367 1026.8649 1037.6785 1049.8376 1094.3643 1114.3359 1121.6403 1142.8433 1151.2852 1161.4360 1173.2379 1202.8970 1244.8292 1270.7021 1278.1317 1356.6654 1384.7310 1389.2402 1422.2523 1432.4490 1450.9242 1457.4501 1461.8057 1463.8576 1472.3197 1484.3777 1575.8538 1609.2287 1626.7038 1656.8042 2992.8900 3004.3350 3035.0588 3088.1375 3095.9332 3106.1367 3123.9710 3141.0913 3148.2920 3158.8818 3175.5453 3186.7660
redmass: 3.6557 4.1493 3.9316 3.7338 1.8113 1.8270 4.1471 6.0305 3.9174 3.6450 1.5239 3.1358 5.0683 6.4528 3.8342 4.9399 6.3616 3.8717 3.8375 5.5561 4.4410 6.3150 6.0398 6.5553 9.1300 4.8743 3.4529 4.6197 1.6830 1.5668 3.5035 2.7936 1.4867 6.1277 3.8746 1.3774 1.3409 3.8862 2.7187 3.9786 2.1939 1.2641 1.8291 2.3170 2.4373 1.7331 1.0792 3.5413 3.6646 1.4812 1.1236 1.2593 10.6488 1.2364 1.2327 2.1358 1.0499 1.0856 1.0617 1.0525 2.5743 1.0543 6.8886 7.5652 9.0488 10.3404 1.0360 1.0295 1.0604 1.0971 1.1024 1.1045 1.1069 1.0866 1.1047 1.0920 1.0963 1.0971
irintensity: 0.9658 2.7215 1.2440 2.2197 2.4845 0.0878 1.9080 1.5503 2.6080 2.3751 2.2288 2.2503 0.0693 1.6938 31.6644 11.2905 5.5075 0.5538 0.5879 1.3210 6.0466 1.6059 1.6307 11.8355 19.0284 37.1320 10.4871 3.2029 29.6186 37.1521 24.6454 19.3389 1.1144 23.9529 14.3766 3.9318 0.0792 102.6545 46.0693 158.9446 77.6225 0.0435 26.9851 585.7707 563.0646 26.3605 17.7712 17.1605 229.5982 21.2655 7.1572 6.2391 3.7636 24.3786 26.3706 12.4915 14.8697 16.2241 10.5749 14.0002 45.2038 14.3890 20.5980 49.3639 250.5712 195.4895 18.8663 36.6924 24.2478 33.2907 2.1010 24.9577 31.8025 3.1760 16.6441 16.2252 6.1942 7.7566
temp: 298.150 k
press: 1.00000 atm
elementType: 8 8 8 8 8 6 6 6 6 6 6 6 6 6 6 6 1 1 1 1 1 1 1 1 1 1 1 1
symmnumber: 1
zpe: 556992.5 jmol-1
zpe.correction: 0.212147 hartree
zpe.thermalcorrener: 0.228301 hartree
zpe.thermalcorrenthalpy: 0.229245 hartree
zpe.thermalcorrgfe: 0.166247 hartree
zpe.sumelectzpe: -801.295295 hartree
zpe.sumelectthermal: -801.279141 hartree
zpe.sumelectthermalent: -801.278197 hartree
zpe.sumelectthermalfe: -801.341196 hartree
dipole: 1.0017 0.3649 0.7154
dipole: 1.2838
quadrupole: -71.6020 -74.5125 -100.5358
quadrupole: -1.6942 -0.3415 0.3683
quadrupole: 10.6147 7.7043 -18.3190 -1.6942 -0.3415 0.3683
hfenergy: -801.5074422 hartree
pointgroup: C01 [X(C11H12O5)]
dipole: -0.3872211 -0.0797893 0.3143636 debye
polarizability: 171.223674|-15.9817518|154.7622142|-13.094278|-16.7585948|86.2119934 unknown
InChI: InChI=1S/C11H12O5/c1-3-15-11(13)16-9-7-5-4-6-8(9)10(12)14-2/h4-7H,3H2,1-2H3
charge 0 multiplicity 1
28 atoms
O  0.825603 0.683726 -1.03179
O  2.866158 -0.168669 -0.853354
O  -1.933919 -2.240268 0.700396
O  0.17943 -1.950929 -0.219279
O  1.662636 0.215625 1.12865
C  -1.349454 -0.037259 -0.022259
C  -0.488536 0.957797 -0.569262
C  -2.668626 0.354496 0.338754
C  -0.936308 2.277613 -0.774068
C  -3.118722 1.67429 0.148356
C  -2.251895 2.638571 -0.418268
C  -0.922592 -1.458221 0.126227
C  4.029438 -0.679437 -0.059406
C  1.780318 0.212932 -0.110726
C  4.892921 0.475115 0.452947
C  -1.596503 -3.670348 0.880654
H  -3.330059 -0.404454 0.76344
H  -0.240182 3.000836 -1.208388
H  -4.13899 1.949558 0.433907
H  -2.594568 3.666465 -0.577317
H  3.640216 -1.297403 0.768345
H  4.564692 -1.310503 -0.785696
H  5.795758 0.070578 0.947129
H  5.216891 1.123333 -0.379463
H  4.340977 1.082575 1.189648
H  -0.723368 -3.774788 1.54648
H  -1.365721 -4.135125 -0.092695
H  -2.494897 -4.115207 1.330939
