program: Gaussian 09
title: 000185433
version: EM64L-G09RevD.01
frameworkgroup: C1[X(C15H22ClNO4)]
method: RPBEPBE
basis: SDD
operation: Freq
keyword: #p
keyword: freq=noraman
keyword: PBEPBE/SDD
title: #p freq=noraman PBEPBE/SDD
converged: YES YES NO NO
title: Mulliken charges:
elementType: Cl O O O O N C C C C C C C C C C C C C C C H H H H H H H H H H H H H H H H H H H H H H
charge: -0.049358 -0.268131 -0.437574 -0.441243 -0.241638 -0.255581 -0.057688 -0.057454 0.484407 0.311333 -0.365467 -0.265231 -0.704642 0.220695 -0.402957 -0.332313 -0.474886 -0.258562 -0.705465 -0.716011 -0.521564 0.255205 0.258449 0.226084 0.250407 0.257389 0.245376 0.212490 0.232930 0.276131 0.238310 0.236898 0.233182 0.249172 0.221603 0.209604 0.304521 0.292273 0.338239 0.206512 0.232441 0.222360 0.339756
chargesum: 0.00000
title: Mulliken charges with hydrogens summed into heavy atoms:
elementType: Cl O O O O N C C C C C C C C C C C C C C C
charge: -0.049358 -0.268131 -0.099335 -0.101487 -0.241638 -0.255581 0.197517 -0.057454 0.484407 0.311333 0.119066 -0.014824 0.010612 0.220695 -0.170028 -0.056182 0.000322 -0.025380 -0.025086 -0.119217 0.139749
polarizability: 1.96846367e+02 -2.57685508e+00 1.96607244e+02 -2.00352274e+01 -7.51730700e+00 1.77667269e+02
1716.lowfreq: -10.8181 -10.5584 -0.0004 0.0012 0.0016 3.4727 21.1579 36.6062 42.0544
frequency: 20.1021 36.5830 42.0382 50.3429 63.0448 68.0880 89.2189 94.4403 98.8284 113.9394 122.1265 132.1652 151.7399 176.0457 184.3156 192.0038 216.3722 226.6470 245.2432 262.8477 269.1388 277.9132 296.1319 301.6216 321.4954 356.8386 384.0204 405.4677 429.8607 445.2202 458.4135 469.3013 490.1133 530.2783 555.7839 561.4748 595.7429 614.7947 637.2394 687.3303 744.2009 746.5887 769.3400 806.8426 826.7493 851.2421 858.0848 888.8607 902.4708 915.7173 926.2802 948.7073 952.4621 978.9338 985.0747 986.3274 994.3345 1044.0819 1047.9193 1064.3909 1077.1214 1101.7623 1114.6010 1120.4615 1124.5032 1148.5459 1162.7724 1180.2502 1184.2090 1203.6516 1231.8665 1250.4751 1254.3996 1256.7620 1276.5224 1310.6087 1316.0569 1325.1019 1331.0457 1356.8789 1359.6644 1373.0255 1375.8169 1388.9054 1392.4846 1394.8019 1430.3413 1434.5772 1447.0018 1451.9480 1460.5450 1461.4611 1463.9694 1466.2590 1471.4711 1474.0652 1478.2691 1483.9166 1573.2964 1589.6382 1597.5742 2937.8328 2981.2422 2982.1996 2993.3413 2998.7648 3009.7742 3018.8512 3063.0690 3065.2888 3070.6038 3079.3199 3083.9173 3094.6942 3097.1953 3102.8021 3110.1407 3119.2820 3144.6540 3165.1968 3173.6605 3517.5276 3543.8534
redmass: 3.8429 3.6647 9.0169 4.5188 3.3348 6.6412 3.4128 3.1149 3.8034 4.6655 3.6075 3.8865 1.8749 2.5545 5.4933 3.1004 1.4857 1.1688 1.9313 2.4004 2.2149 3.3718 2.7377 2.1033 3.5882 3.7800 3.5750 3.8309 2.5250 2.8349 1.2255 3.5172 3.4576 5.8900 3.8330 4.4391 4.0565 4.1059 5.1116 3.6914 5.5778 5.8074 2.5248 1.8483 3.6072 4.4153 3.1511 3.5517 1.8839 1.3906 1.3348 3.1770 2.4264 2.3091 1.5734 2.1636 1.7544 3.2995 2.1254 2.5463 2.5595 1.8397 1.3010 1.3472 1.6785 1.7115 1.1426 1.8897 1.1617 2.7079 1.7095 2.7088 1.6989 1.1956 1.3368 1.8816 1.8883 1.4932 1.5985 1.2433 1.4628 1.4538 1.8849 1.2130 1.2375 1.2636 1.1255 1.1237 2.3173 1.7543 1.0678 1.1853 1.0895 1.2036 1.0572 1.0529 1.0672 1.0639 8.8572 7.2465 6.0627 1.0338 1.0595 1.0370 1.0788 1.0396 1.0568 1.1024 1.0933 1.1049 1.1054 1.0569 1.0917 1.0984 1.0982 1.0988 1.1012 1.0874 1.0904 1.0982 1.1115 1.0657 1.0661
irintensity: 0.3299 1.0125 0.3019 1.0558 1.6317 2.9361 2.6123 2.7649 1.5871 0.7885 2.0117 0.3084 1.9284 0.5756 4.4964 5.2201 5.5636 4.2734 0.4685 20.8826 16.8581 3.5707 43.8136 56.3724 16.2356 1.8542 17.4997 8.7549 0.1616 14.4766 115.7260 9.0448 13.1199 10.3602 18.4330 12.9632 33.1735 13.7433 4.1837 6.4338 2.7292 4.6521 9.8184 61.6722 13.6605 9.0568 10.4473 2.9213 3.9704 3.3504 10.9394 18.7736 54.2516 1.0005 35.2082 19.5047 3.9920 58.1773 94.8139 19.4008 30.5200 9.3572 2.2085 18.2743 13.7015 33.0576 40.7877 7.3889 5.8090 9.2342 16.3095 8.3119 21.4599 12.3589 9.8752 33.0935 31.6832 36.3771 24.9153 29.0565 38.2055 17.9229 2.8202 21.5409 26.6089 17.9651 19.6362 6.1276 23.5018 13.5042 8.7418 15.1851 4.3695 4.4224 9.5408 6.8329 13.1845 13.2484 254.9502 0.6125 14.3013 53.7511 17.5499 17.9165 7.6376 19.1958 30.8700 48.8878 7.5005 13.0395 16.8364 11.8482 23.4130 24.3225 28.4161 33.2498 9.3055 9.7895 9.9154 15.6391 2.5567 17.9034 6.9294
temp: 298.150 k
press: 1.00000 atm
elementType: 17 8 8 8 8 7 6 6 6 6 6 6 6 6 6 6 6 6 6 6 6 1 1 1 1 1 1 1 1 1 1 1 1 1 1 1 1 1 1 1 1 1 1
symmnumber: 1
zpe: 916116.8 jmol-1
zpe.correction: 0.348930 hartree
zpe.thermalcorrener: 0.372664 hartree
zpe.thermalcorrenthalpy: 0.373608 hartree
zpe.thermalcorrgfe: 0.294626 hartree
zpe.sumelectzpe: -1398.841943 hartree
zpe.sumelectthermal: -1398.818209 hartree
zpe.sumelectthermalent: -1398.817265 hartree
zpe.sumelectthermalfe: -1398.896247 hartree
dipole: -1.0480 5.8063 0.5363
dipole: 5.9244
quadrupole: -141.4930 -126.1939 -140.5283
quadrupole: 1.9916 0.3231 2.1284
quadrupole: -5.4213 9.8778 -4.4566 1.9916 0.3231 2.1284
hfenergy: -1399.1908731 hartree
pointgroup: C01 [X(C15H22Cl1N1O4)]
dipole: -0.0685894 -2.3119107 0.2885069 debye
polarizability: 178.1211771|-3.0048483|197.687496|21.3491445|2.6164638|195.312207 unknown
InChI: InChI=1S/C15H22ClNO4/c1-10(9-21-3)17(14(20)7-16)15-12(8-18)5-4-6-13(15)11(2)19/h4-6,10-11,18-19H,7-9H2,1-3H3
charge 0 multiplicity 1
43 atoms
Cl -3.455237 1.61182 -0.120878
O  3.767993 1.123707 0.00526
O  1.793794 -2.375316 1.327002
O  -2.110861 1.387528 -3.287293
O  -0.740296 2.116036 2.1106
N  -0.025057 0.796491 0.320161
C  1.341375 1.438714 0.426922
C  -0.268811 -0.325997 -0.576864
C  -0.116468 -1.660036 -0.083114
C  -0.666809 -0.092048 -1.922287
C  2.433632 0.571686 -0.251708
C  0.36656 -1.943584 1.343301
C  1.348084 2.881135 -0.119402
C  -0.99092 1.242446 1.222661
C  -0.370986 -2.742257 -0.959632
C  -0.912188 -1.201419 -2.770336
C  -0.877887 1.307294 -2.492225
C  -0.761572 -2.519075 -2.297301
C  -0.493087 -2.960678 2.114647
C  -2.393021 0.641414 1.126177
C  4.274732 0.817328 1.348404
H  1.549021 1.493577 1.514239
H  2.386764 -0.477956 0.098408
H  2.326802 0.598733 -1.350783
H  0.412708 -1.004027 1.916152
H  0.605652 3.50492 0.404333
H  2.351475 3.311816 0.042849
H  1.147818 2.904069 -1.205094
H  -0.27339 -3.771938 -0.594465
H  -1.244389 -1.004178 -3.794789
H  -0.873625 2.063182 -1.687157
H  -0.07832 1.557442 -3.212123
H  -0.954728 -3.367688 -2.962306
H  -0.063968 -3.117048 3.118932
H  -1.530641 -2.596275 2.231081
H  -0.539687 -3.940306 1.603662
H  -2.906411 0.786055 2.084986
H  -2.432448 -0.400088 0.781139
H  1.860613 -3.227486 0.823034
H  3.761459 1.408168 2.1351
H  5.341894 1.09005 1.335096
H  4.16375 -0.261792 1.580085
H  -2.875823 1.30938 -2.657977
