program: Gaussian 09
title: 000185364
version: EM64L-G09RevD.01
frameworkgroup: C1[X(C8H11Cl)]
method: RPBEPBE
basis: SDD
operation: Freq
keyword: #pfreq=noraman
keyword: PBEPBE/SDD
title: #p freq=noraman PBEPBE/SDD
converged: YES YES NO NO
title: Mulliken charges:
elementType: Cl C C C C C C C C H H H H H H H H H H H
charge: -0.096800 -0.218499 -0.165074 -0.061720 -0.451395 -0.463465 -0.668291 -0.210793 -0.206131 0.231507 0.239620 0.268105 0.208703 0.218647 0.216527 0.219471 0.252711 0.269841 0.208365 0.208673
chargesum: 0.00000
title: Mulliken charges with hydrogens summed into heavy atoms:
elementType: Cl C C C C C C C C
charge: -0.096800 0.013008 0.074545 0.206385 -0.024045 -0.027468 -0.145740 -0.002428 0.002542
polarizability: 1.02862502e+02 -9.99708548e+00 9.37701228e+01 -1.51182607e+00 1.18958508e+00 6.69335633e+01
1716.lowfreq: -6.8315 -3.9973 -0.0009 -0.0008 0.0013 12.3527 63.7818 86.7333 126.4076
frequency: 63.7448 86.7329 126.3703 230.5743 252.6381 321.0338 386.9949 390.4842 519.4403 552.4434 625.0945 666.8172 760.3023 778.0463 821.8164 874.4913 884.4522 904.6990 937.6629 967.5583 986.8569 1001.5165 1039.0155 1060.7388 1078.6219 1105.8212 1126.9099 1155.7084 1190.6832 1205.3989 1207.8172 1229.7846 1251.5463 1296.5645 1324.6478 1340.0177 1347.2553 1386.7983 1437.8532 1452.9844 1459.9541 1463.4820 1680.4780 2952.7066 2955.8081 2991.9109 2998.9234 3045.8390 3096.4743 3097.9514 3111.3363 3115.7450 3129.5075 3135.3037
redmass: 4.0267 4.9292 2.4878 2.6124 3.0426 3.0788 2.6150 2.3532 5.7052 3.9567 6.1859 1.1712 3.2818 3.5211 2.2360 2.0643 1.7290 2.1234 2.5591 1.6278 1.6224 1.7535 1.3596 1.5677 1.2353 1.3860 1.8638 1.2268 1.2202 1.1657 1.1674 1.3810 1.1761 1.3895 1.3445 2.0878 1.6517 1.5556 2.2380 1.1545 1.0791 1.2244 6.3995 1.0605 1.0616 1.0983 1.0973 1.0572 1.0855 1.0862 1.0940 1.0959 1.0992 1.1020
irintensity: 1.6705 0.6651 2.4262 2.3689 1.5294 4.3695 2.9116 4.1960 1.4103 1.6504 69.4051 60.0590 6.3102 3.8621 1.6182 1.1676 8.1186 1.4199 5.9907 0.3658 1.5761 3.3434 9.1022 13.7243 8.6407 5.0401 13.9700 9.8001 4.9828 2.5060 7.0336 6.7057 18.7377 12.8708 1.5802 0.7655 3.2052 0.4987 11.7741 6.6543 14.5749 4.2982 4.7493 49.0305 43.7676 27.2052 24.2854 24.6134 1.7957 20.8429 28.0020 11.3220 49.7561 21.3314
temp: 298.150 k
press: 1.00000 atm
elementType: 17 6 6 6 6 6 6 6 6 1 1 1 1 1 1 1 1 1 1 1
symmnumber: 1
zpe: 440305.7 jmol-1
zpe.correction: 0.167704 hartree
zpe.thermalcorrener: 0.176382 hartree
zpe.thermalcorrenthalpy: 0.177326 hartree
zpe.thermalcorrgfe: 0.133254 hartree
zpe.sumelectzpe: -770.774292 hartree
zpe.sumelectthermal: -770.765614 hartree
zpe.sumelectthermalent: -770.764670 hartree
zpe.sumelectthermalfe: -770.808742 hartree
dipole: 2.4004 -1.5401 0.6722
dipole: 2.9302
quadrupole: -69.2577 -57.0279 -60.1228
quadrupole: 2.8359 -2.3426 0.0240
quadrupole: -7.1216 5.1082 2.0133 2.8359 -2.3426 0.0240
hfenergy: -770.9419957 hartree
pointgroup: C01 [X(C8H11Cl1)]
dipole: 0.8546418 0.7161565 -0.292709 debye
dipolederiv: -0.6550819 -0.174389 0.0693389 -0.4257262 -0.418116 0.0705593 0.0737538 0.0381467 -0.2150323 0.1404846 -0.0505739 0.0109397 -0.0749326 -0.0516371 0.0283127 -0.1803705 -0.0571272 0.1551871 0.1286951 0.0308713 -0.0027319 0.1032805 -0.0171061 -0.0848785 -0.0447801 -0.065929 0.0982577 -0.5200146 -0.0696045 0.1421148 -0.0520127 -0.0686839 -0.0061066 0.2261275 0.068291 -0.064237 0.0847245 -0.0098135 -0.0943482 0.0465475 0.0337897 0.0762438 -0.0397569 0.1379624 0.0999409 0.0951922 -0.0014547 -0.1136598 -0.0381657 0.060606 -0.046468 -0.1087329 -0.079444 0.0539063 0.9429879 0.3138317 -0.1484171 0.4225214 0.495836 -0.0745435 -0.0191952 -0.0534236 0.181997 -0.0646833 -0.0386303 0.1859371 -0.0932274 0.0761876 -0.0645335 0.1991784 -0.1327613 -0.0790376 -0.0228074 0.026667 0.2084149 0.0606044 0.0299578 0.0272511 0.2458171 0.095009 -0.0267704 -0.0057283 0.0499139 -0.0905614 0.0160217 -0.0268857 0.098057 -0.0672662 0.1050701 -0.0171208 -0.0236286 -0.0085693 -0.1140533 0.0214869 0.0319877 -0.0483575 -0.0875387 -0.0552549 -0.0490169 0.0286494 0.0131091 -0.0338069 0.041512 0.0862755 0.0307513 -0.0135895 0.0106786 -0.0625957 0.0388341 0.0680741 0.007153 0.0142853 -0.1029327 -0.0983348 -0.0255272 -0.1538922 -0.0228064 -0.0782248 -0.0582991 0.0820468 -0.0592382 0.0058003 0.0631257 0.0718969 0.1306091 -0.0262056 -0.0335575 0.042456 0.071757 0.0632782 0.0325176 -0.0683295 0.0539321 -0.1359568 -0.0786008 0.0053548 -0.1037182 0.0091252 -0.0442229 -0.099438 0.0589982 0.0070156 0.1103199 0.0366987 0.0248101 -0.0622536 0.0256448 -0.0545122 0.0014318 0.0590619 -0.0588967 0.0762648 -0.0907392 -0.0514083 -0.0050006 0.0584023 -0.0004188 -0.0852809 -0.0583778 0.0861276 -0.0786236 0.0321363 -0.0367062 -0.0306171 -0.1530978 -0.0377186 0.0398321 -0.0350922 -0.1775374 -0.0327556 0.0230777 0.0021084 0.0680006 -0.1201982 0.0906374 -0.0241415 0.0726609 -0.1406578 0.0728166 0.0509611 unknown
polarizability: 99.74886|10.9621037|96.8791754|1.4343905|-0.4127314|66.938153 unknown
InChI: InChI=1S/C8H11Cl/c9-5-8-6-3-1-2-4-7(6)8/h1-2,6-8H,3-5H2
charge 0 multiplicity 1
20 atoms
Cl -3.448049 -0.981554 0.240653
C  0.168944 0.986803 -0.689887
C  -0.079958 -0.51702 -0.880701
C  -0.906999 0.256208 0.157705
C  1.45251 1.472217 -0.015898
C  0.964702 -1.527965 -0.407956
C  -2.351153 0.559234 -0.093564
C  2.204731 0.381756 0.725378
C  1.988721 -0.948216 0.550164
H  -0.213423 1.649371 -1.476724
H  -0.62637 -0.81275 -1.78481
H  -0.641561 0.078676 1.206411
H  1.226491 2.308322 0.67792
H  2.121742 1.901282 -0.792161
H  1.497698 -1.936156 -1.293088
H  0.459043 -2.395031 0.063716
H  -2.562009 0.818514 -1.143055
H  -2.763181 1.321997 0.584238
H  2.982299 0.712705 1.427451
H  2.595423 -1.669393 1.114906
