program: Gaussian 09
title: 000185390
version: EM64L-G09RevD.01
frameworkgroup: C1[X(C19H21ClN2O2)]
method: RPBEPBE
basis: SDD
operation: Freq
keyword: #p
keyword: freq=noraman
keyword: PBEPBE/SDD
title: #p freq=noraman PBEPBE/SDD
converged: YES YES NO NO
title: Mulliken charges:
elementType: Cl O O N N C C C C C C C C C C C C C C C C C C C H H H H H H H H H H H H H H H H H H H H H
charge: -0.062745 -0.260187 -0.442501 -0.103964 -0.150954 -0.089040 -0.406292 -0.448279 -0.354703 -0.401200 -0.321921 -0.099366 0.476861 0.463669 -0.353391 -0.429503 -0.451680 -0.346183 -0.229124 -0.208077 -0.223276 -0.239809 -0.114476 -0.243532 0.259228 0.248439 0.240595 0.232193 0.207861 0.190932 0.241544 0.228904 0.232030 0.206316 0.236610 0.358621 0.264807 0.233482 0.228872 0.242606 0.253198 0.252481 0.225598 0.226127 0.229231
chargesum: 0.00000
title: Mulliken charges with hydrogens summed into heavy atoms:
elementType: Cl O O N N C C C C C C C C C C C C C C C C C C C
charge: -0.062745 -0.260187 -0.083880 -0.103964 -0.150954 0.170188 0.082742 -0.008225 0.077772 0.059734 -0.115605 0.137244 0.476861 0.463669 -0.088584 -0.196021 -0.222808 -0.103577 0.024074 0.044404 0.002322 -0.013683 -0.114476 -0.014301
chargesum: -0.00008
polarizability: 2.34324769e+02 1.35674661e+01 2.50972441e+02 9.23527344e-01 3.95607807e+00 1.96455733e+02
1716.lowfreq: -10.9868 -0.1748 -0.0722 -0.0063 2.8899 4.2882 12.0400 31.4747 38.2255
frequency: 9.8114 31.4614 38.1876 41.8214 55.8014 64.3396 68.6764 107.3490 129.6673 173.8333 184.3647 203.9559 220.4570 242.9125 256.4215 313.2933 317.2518 334.5178 355.0945 372.8444 399.5245 402.6519 412.1825 414.1012 426.9354 440.0009 485.6749 490.2469 499.9107 545.0886 583.5485 609.9889 618.2005 621.0604 642.9564 673.4040 701.9480 707.1236 718.9804 762.7174 797.1101 803.8415 816.5837 834.0472 838.0462 843.2778 852.8875 857.6256 891.2747 911.1394 923.4094 953.4419 958.4284 968.1338 974.8304 986.0870 990.7789 993.8146 995.6662 998.7201 1001.5800 1025.5240 1048.0901 1064.3093 1069.3622 1070.8560 1078.6276 1090.1082 1107.1650 1117.0512 1151.3734 1165.1351 1171.5075 1172.3865 1175.9057 1184.7435 1188.5163 1196.6863 1202.9409 1206.0082 1238.2278 1259.9223 1271.9620 1287.9229 1293.8541 1306.9160 1307.0403 1330.3982 1331.6067 1337.7598 1345.0640 1355.1492 1369.0685 1380.9433 1383.8599 1388.7704 1395.9285 1440.8293 1446.7061 1463.3798 1472.3586 1474.6328 1479.6301 1486.9454 1588.0808 1594.0381 1597.5346 1610.3090 2834.7261 2859.7746 2899.3422 2946.0067 2995.7314 3029.1256 3033.4118 3050.0146 3065.2314 3068.6550 3073.4027 3114.4645 3125.5459 3126.7437 3138.1069 3141.2995 3150.0571 3164.0933 3166.8343 3170.1219 3558.8411
redmass: 4.5024 7.4884 4.6431 4.7272 5.0381 4.5406 4.6840 3.8105 5.4713 3.3983 4.2828 5.8387 5.5048 4.6573 4.7468 2.8598 2.6909 5.1982 1.5483 4.0216 2.2984 2.8019 2.9854 3.4997 4.9557 2.8418 3.6446 4.2198 4.7000 3.2847 3.2841 4.0225 4.7419 6.3758 3.6101 5.0357 1.9723 5.0991 2.9214 2.2624 2.5414 2.5214 3.2199 1.4496 2.9276 2.5454 1.3612 1.9670 2.9782 3.9068 1.5675 1.5873 2.3129 2.8921 1.3939 1.4875 4.8932 2.1242 1.6391 3.0485 3.0116 2.1906 1.8751 2.5994 2.5917 2.6602 1.8885 2.0020 1.6263 3.0791 2.4053 2.1477 1.1324 1.3589 1.1603 1.2430 2.1735 1.4926 1.7504 1.2119 1.2496 1.5140 1.3488 1.3455 1.3637 1.3729 1.2989 1.4293 1.3572 1.3067 1.2779 1.2711 1.9189 4.9963 1.6178 3.4840 2.4252 2.1069 1.0882 1.0892 2.3658 1.0961 2.2799 1.0831 7.3841 6.1680 6.3384 6.1463 1.0812 1.0709 1.0698 1.0664 1.0624 1.0885 1.0875 1.0954 1.1017 1.0881 1.0916 1.0873 1.0863 1.0894 1.0911 1.0892 1.0951 1.1012 1.0953 1.0960 1.0655
irintensity: 0.1959 0.0554 0.0857 0.0372 0.0225 0.4273 1.9090 0.5548 0.0651 1.1278 1.4300 2.3013 0.2541 0.3096 1.4099 16.1411 17.5600 0.8429 91.6281 4.1889 59.0561 0.6725 0.3019 5.4253 6.8581 10.9177 12.6528 35.4046 18.0040 50.0953 6.1744 3.4046 3.7529 3.0372 3.7812 7.7221 35.7152 10.8035 21.2879 54.7558 2.6693 44.1898 19.0052 1.0945 29.2044 12.4080 1.0860 7.5600 92.7275 69.2479 9.8254 22.0029 88.8122 14.1702 0.2474 13.7794 1.3977 34.8481 2.6425 34.6795 25.7407 7.0985 23.7764 9.5693 47.3971 28.5561 45.2932 67.7550 22.8037 27.6830 18.3795 13.4281 2.2517 7.2594 0.2214 2.9897 6.6152 16.5315 12.9571 29.6790 7.7453 3.9494 11.2616 8.0655 10.9387 10.6347 3.8165 4.0319 3.9117 8.9685 6.0385 12.5754 6.4697 3.2424 7.2687 7.3503 11.3266 13.3646 10.7972 0.9199 93.1591 2.8797 11.9392 10.2696 1.9940 0.5209 8.1270 6.7440 39.1879 75.5274 38.4293 52.3118 40.8064 21.9832 30.6437 90.6465 32.9860 26.7090 16.6191 7.5604 1.1820 7.6284 19.0061 2.7976 30.9213 23.6685 6.9176 1.2950 8.0741
temp: 298.150 k
press: 1.00000 atm
elementType: 17 8 8 7 7 6 6 6 6 6 6 6 6 6 6 6 6 6 6 6 6 6 6 6 1 1 1 1 1 1 1 1 1 1 1 1 1 1 1 1 1 1 1 1 1
symmnumber: 1
zpe: 952859.7 jmol-1
zpe.correction: 0.362925 hartree
zpe.thermalcorrener: 0.383932 hartree
zpe.thermalcorrenthalpy: 0.384876 hartree
zpe.thermalcorrgfe: 0.310143 hartree
zpe.sumelectzpe: -1454.831648 hartree
zpe.sumelectthermal: -1454.810641 hartree
zpe.sumelectthermalent: -1454.809697 hartree
zpe.sumelectthermalfe: -1454.884430 hartree
dipole: 1.7848 2.5630 1.3729
dipole: 3.4117
quadrupole: -154.8481 -144.3921 -140.8586
quadrupole: -8.1596 0.5359 -3.5603
quadrupole: -8.1485 2.3075 5.8410 -8.1596 0.5359 -3.5603
hfenergy: -1455.194573 hartree
pointgroup: C01 [X(C19H21Cl1N2O2)]
dipole: 0.2992918 -1.1135229 -0.6871561 debye
polarizability: 227.2056623|-4.4890412|255.8454939|1.0794622|11.9773626|198.7017863 unknown
InChI: InChI=1S/C19H21ClN2O2/c20-16-8-6-15(7-9-16)19(14-4-2-1-3-5-14)22-11-10-21-13-18(23)24-17(21)12-22/h1-9,17-19,23H,10-13H2
charge 0 multiplicity 1
45 atoms
Cl -3.269353 5.053752 0.961574
O  4.025571 1.011081 0.811888
O  4.803122 0.698995 -1.472076
N  3.381824 -1.20777 1.009848
N  0.655181 -0.574505 0.170439
C  2.84168 0.173201 1.059697
C  1.732636 0.447254 0.012415
C  2.322652 -2.241206 0.932551
C  1.223351 -1.924265 -0.109802
C  4.43128 -1.213446 -0.046002
C  -0.55076 -0.257982 -0.654991
C  4.913521 0.254884 -0.088731
C  -1.170607 1.088095 -0.244318
C  -1.616158 -1.362309 -0.544516
C  -1.197802 1.507708 1.109191
C  -1.790851 1.902629 -1.221358
C  -2.195094 -1.910171 -1.713842
C  -2.064786 -1.819544 0.720979
C  -1.83086 2.712126 1.484181
C  -2.435478 3.109328 -0.867099
C  -3.20757 -2.89407 -1.626492
C  -3.069605 -2.805641 0.811949
C  -2.445455 3.493755 0.486641
C  -3.648488 -3.34501 -0.362136
H  2.473843 0.406961 2.074408
H  1.321105 1.454914 0.184316
H  2.17706 0.426623 -1.011637
H  1.843993 -2.315065 1.927669
H  2.792963 -3.216152 0.712129
H  1.641696 -1.973982 -1.147466
H  0.425071 -2.680668 -0.034746
H  4.061396 -1.473636 -1.061214
H  5.243994 -1.90893 0.22524
H  -0.270116 -0.179372 -1.737752
H  5.934734 0.427501 0.296432
H  5.07609 1.650576 -1.529356
H  -0.700193 0.891171 1.865415
H  -1.778954 1.594882 -2.273989
H  -1.850469 -1.569453 -2.698429
H  -1.612518 -1.407056 1.629412
H  -1.846301 3.036248 2.528907
H  -2.914617 3.734743 -1.625891
H  -3.646398 -3.308867 -2.540955
H  -3.405679 -3.151873 1.796012
H  -4.43205 -4.107656 -0.290893
