program: Gaussian 09
title: 000185361
version: EM64L-G09RevD.01
frameworkgroup: C1[X(C10H11ClO4)]
method: RPBEPBE
basis: SDD
operation: Freq
keyword: #p
keyword: freq=noraman
keyword: PBEPBE/SDD
title: #p freq=noraman PBEPBE/SDD
converged: YES YES NO NO
title: Mulliken charges:
elementType: Cl O O O O C C C C C C C C C C H H H H H H H H H H H
charge: 0.023145 -0.335687 -0.281783 -0.425282 -0.200858 0.523861 0.384945 0.233433 -0.551412 -0.519935 0.021061 0.098633 -0.783917 -0.509811 -0.513354 0.270825 0.238624 0.240745 0.264422 0.388419 0.253743 0.239677 0.226239 0.216754 0.233148 0.264364
chargesum: 0.00000
title: Mulliken charges with hydrogens summed into heavy atoms:
elementType: Cl O O O O C C C C C C C C C C
charge: 0.023145 -0.335687 -0.281783 -0.036863 -0.200858 0.523861 0.384945 0.233433 -0.551412 -0.249110 0.021061 0.098633 -0.040126 0.209848 0.200912
polarizability: 1.86364883e+02 -9.90301552e-01 1.63636727e+02 -1.61254825e-01 -1.61620405e+00 7.02030622e+01
1716.lowfreq: -1.7921 -0.0016 -0.0016 -0.0013 4.6373 11.5376 37.4504 43.0211 61.7073
frequency: 37.4292 42.9814 61.6880 81.9633 113.1309 124.9621 149.1206 166.5702 171.1838 174.1040 215.6912 220.3073 249.8913 303.3890 312.5863 324.4357 345.6962 357.7462 393.1774 439.2182 477.0118 518.1521 560.8630 608.1667 613.7263 638.3104 665.6960 680.1421 757.2650 780.4469 838.4083 882.3745 899.9582 951.0400 987.5436 1019.0912 1041.6102 1111.7120 1113.8508 1130.8490 1150.2599 1156.6592 1170.3782 1215.0308 1265.9931 1311.3934 1366.1259 1374.2234 1400.4612 1432.6231 1441.2774 1449.7813 1452.7000 1454.9399 1458.8547 1464.3786 1475.2317 1479.1549 1573.6601 1597.2352 1605.8477 2986.9989 2987.3432 2987.7692 3076.0521 3098.4007 3098.4714 3124.7612 3135.4475 3137.9694 3183.1284 3397.4593
redmass: 4.2023 2.8184 4.9072 2.5118 1.8042 3.8654 1.4402 4.0472 1.0830 1.9456 8.7814 5.0335 4.4713 5.5321 9.7659 5.5729 5.1201 5.4122 5.8034 6.4399 6.5409 4.0899 4.1304 4.3801 5.7665 1.1143 5.5233 4.8651 4.7983 7.1979 6.4530 1.5893 7.8138 3.6397 2.7352 1.8381 5.3412 1.2388 1.2402 2.5678 1.4441 1.6356 3.2708 1.8138 2.1326 4.0716 1.6168 2.4644 3.7208 1.6770 1.2942 1.5215 1.2699 1.0565 1.2135 1.0673 1.0527 1.0536 8.0992 5.9323 8.9447 1.0340 1.0380 1.0322 1.0960 1.1016 1.0983 1.0999 1.1045 1.1055 1.0904 1.0629
irintensity: 2.5310 9.9761 1.1055 3.7564 0.6106 0.3592 0.2911 3.1582 1.0620 4.0531 3.5024 3.0996 5.6528 11.5411 1.5507 8.3564 2.6944 3.5688 2.2908 2.1616 3.4037 1.3467 25.7514 10.2739 11.2498 129.1081 12.7547 5.2482 1.5624 10.0709 18.5079 27.9350 50.0681 85.8832 14.1872 4.2399 110.7587 6.6359 4.1882 10.2049 6.7760 19.0434 88.5476 144.7640 359.0211 243.5724 1.6070 149.5896 14.8094 41.7489 27.2943 71.3575 5.2400 14.2649 2.7850 19.5267 30.3494 15.9021 194.7039 23.1405 60.0855 92.0753 2.1465 44.4432 12.2446 12.5662 45.3454 13.7155 12.2803 13.4252 0.9014 108.0412
temp: 298.150 k
press: 1.00000 atm
elementType: 17 8 8 8 8 6 6 6 6 6 6 6 6 6 6 1 1 1 1 1 1 1 1 1 1 1
symmnumber: 1
zpe: 502859.2 jmol-1
zpe.correction: 0.191529 hartree
zpe.thermalcorrener: 0.207684 hartree
zpe.thermalcorrenthalpy: 0.208628 hartree
zpe.thermalcorrgfe: 0.147132 hartree
zpe.sumelectzpe: -1147.444144 hartree
zpe.sumelectthermal: -1147.427989 hartree
zpe.sumelectthermalent: -1147.427045 hartree
zpe.sumelectthermalfe: -1147.488541 hartree
dipole: 4.0963 0.6925 -0.1092
dipole: 4.1558
quadrupole: -102.3691 -77.5307 -95.4549
quadrupole: 2.9177 -1.5514 6.9422
quadrupole: -10.5842 14.2542 -3.6700 2.9177 -1.5514 6.9422
hfenergy: -1147.6356729 hartree
pointgroup: C01 [X(C10H11Cl1O4)]
dipole: 1.5847658 -0.4019588 0.0168365 debye
dipolederiv: -0.1262842 0.2063081 -0.0913124 0.1840518 -0.5602122 0.1479615 -0.0983442 0.1740812 -0.071076 -0.4674846 -0.2325546 -0.0484486 -0.4307769 -1.2340899 -0.1120962 0.0523749 0.0250781 -0.3530485 -0.9301998 0.7224834 -0.0208655 0.7276852 -1.069973 -0.0124712 -0.1350292 0.2206479 -0.342073 -1.4595743 -0.1548045 0.0205091 -0.1980307 -0.3089515 -0.0635095 -0.0034471 -0.0537255 -0.3316166 -1.0250048 0.0459542 0.0679053 0.3252111 -0.5736608 -0.0785191 0.0438604 -0.057687 -0.2981102 -1.0192684 -0.1516872 0.0355097 -0.131029 -0.2365295 0.0360531 0.0018606 0.0661997 0.0233526 0.0317094 0.394277 0.0373855 0.6517723 0.6262614 -0.0105608 -0.1408737 -0.1356741 0.0097742 0.191058 -0.5600261 0.1557601 -1.0238178 1.0216383 -0.0736578 0.3329235 -0.2885682 0.0754001 0.2692189 -0.3697011 0.1287115 -0.0865615 0.6757958 -0.2908539 0.1236683 -0.2898563 -0.0082182 0.1116104 0.2043517 -0.0313446 -0.1150764 -0.1598009 -0.0241917 -0.0316787 -0.081115 -0.1458061 1.2511651 0.1264368 -0.0336993 0.2308739 -0.1768078 -0.0029895 -0.0956615 0.0596379 0.0124746 1.8547986 0.3062313 -0.1310572 0.1147915 0.8901188 0.1009719 -0.0626237 0.0551382 0.1208941 -0.1594472 -0.1836186 0.0023815 -0.2936946 -0.4127299 -0.0045529 0.0251884 0.028275 0.0485979 0.1400154 -0.0467304 0.0233824 0.182511 0.685727 0.1494474 0.111053 0.2758749 0.3800969 0.6841223 -0.4691099 -0.0621855 -0.1586742 0.3399202 0.0662466 -0.1628736 0.1585515 0.34618 0.1098531 -0.0446154 0.0095078 -0.0475246 -0.0022801 0.0308533 0.0238974 0.0255132 0.1422877 0.1001747 0.0313918 -0.0747416 0.0034578 0.0478671 0.0580789 -0.0450629 0.0731536 -0.0341879 0.0604887 0.0436984 0.0936332 0.0239249 0.039549 -0.0636003 0.0650908 -0.0838245 -0.0121475 -0.1062346 -0.0272688 -0.0216129 0.046571 0.0936391 -0.0007663 -0.0262116 -0.0147297 0.1183157 0.4374944 -0.0076396 -0.0338121 0.0601352 0.2753947 0.0541593 -0.0162439 0.0235295 0.3336875 -0.0044019 0.1614278 0.0280735 0.0390393 0.0472001 -0.0273038 -0.0181402 -0.0249966 0.0711985 -0.0064031 -0.1444402 0.0406721 -0.1039648 -0.0372422 0.0055865 0.0538474 0.0219021 0.0716135 0.0814174 0.0209709 -0.045631 0.0198195 -0.0042907 0.0812967 -0.0821619 -0.0609715 -0.1351675 -0.0193533 0.0741013 -0.0515335 0.0028691 0.086388 0.019797 0.0717171 -0.1076449 -0.1711044 0.0569278 0.0612663 0.0134619 0.1169297 -0.1367418 0.0574204 0.0008601 0.067623 0.0825335 -0.056398 -0.0067027 -0.0106494 -0.1404928 0.0838106 -0.0427996 0.0120101 -0.0764124 0.0661492 unknown
polarizability: 181.9256916|-8.9353035|166.9141035|1.5855755|-10.7151145|71.3648772 unknown
InChI: InChI=1S/C10H11ClO4/c1-5(12)6-4-7(14-2)9(13)10(15-3)8(6)11/h4,13H,1-3H3
charge 0 multiplicity 1
26 atoms
Cl -1.500098 2.532998 -0.386789
O  1.571069 2.196824 -0.162666
O  1.520923 -2.550426 0.945294
O  2.935804 0.006831 0.386307
O  -3.56939 0.673738 0.620686
C  -1.31476 -0.201347 0.399571
C  0.774108 1.061965 0.129172
C  0.890877 -1.343599 0.627108
C  -0.633211 1.018062 0.111605
C  -0.518161 -1.354711 0.636888
C  1.546672 -0.10889 0.379068
C  -2.814471 -0.328746 0.478826
C  -3.421514 -1.73227 0.408289
C  1.501225 3.325154 0.805341
C  2.794353 -2.894335 0.273668
H  -0.992804 -2.315437 0.849513
H  -3.228446 -2.293887 1.34224
H  -3.01349 -2.322125 -0.431145
H  -4.510881 -1.626929 0.291796
H  3.137605 0.948046 0.110133
H  0.500449 3.785061 0.786711
H  2.255914 4.045183 0.455699
H  1.743469 2.972375 1.825005
H  2.665111 -2.88842 -0.82499
H  3.019781 -3.913706 0.620687
H  3.596069 -2.195709 0.557486
