program: Gaussian 09
title: 000185358
version: EM64L-G09RevD.01
frameworkgroup: C1[X(C2H6N2O)]
method: RPBEPBE
basis: SDD
operation: Freq
keyword: #pfreq=noraman
keyword: PBEPBE/SDD
title: #p freq=noraman PBEPBE/SDD
converged: NO NO NO NO
title: Mulliken charges:
elementType: O N N C C H H H H H H
charge: -0.291486 0.055886 -0.043812 -0.562563 -0.654019 0.256674 0.256707 0.254950 0.247847 0.231964 0.247852
chargesum: 0.00000
title: Mulliken charges with hydrogens summed into heavy atoms:
elementType: O N N C C
charge: -0.291486 0.055886 -0.043812 0.205768 0.073643
polarizability: 5.23327035e+01 3.78583373e+00 4.57337077e+01 2.55344265e-03 2.16710180e-03 2.72278454e+01
1716.lowfreq: -115.7911 -10.8255 -0.0011 -0.0010 -0.0007 4.9555 18.6062 174.3411 230.9782
frequency: -115.7860 174.2806 230.9754 287.7888 437.4472 585.5111 619.9734 850.1226 976.1156 1048.5419 1096.6789 1103.0573 1145.1178 1250.9540 1373.4337 1399.7297 1428.5230 1447.6242 1448.8047 1458.2322 1475.1994 2959.4244 3030.8441 3033.0537 3128.3125 3143.1997 3174.0496
redmass: 1.0881 1.0693 2.6949 3.1467 3.4827 4.4806 4.3394 4.1638 3.5400 1.3611 1.8687 1.3871 1.7008 7.6242 1.9951 1.1723 1.4138 1.0465 1.0538 1.0462 1.3580 1.0363 1.0973 1.0311 1.0987 1.1032 1.1049
irintensity: 0.1309 0.3785 13.5414 19.8347 2.9622 1.7293 9.8327 1.7752 11.1846 0.1019 6.7724 1.9285 2.7026 35.8589 85.6127 13.1000 21.1613 12.9143 23.0845 23.6254 11.2953 17.9721 26.3981 6.5611 18.8574 9.7090 2.8733
temp: 298.150 k
press: 1.00000 atm
elementType: 8 7 7 6 6 1 1 1 1 1 1
symmnumber: 1
zpe: 229126.7 jmol-1
zpe.correction: 0.087270 hartree
zpe.thermalcorrener: 0.092512 hartree
zpe.thermalcorrenthalpy: 0.093456 hartree
zpe.thermalcorrgfe: 0.059093 hartree
zpe.sumelectzpe: -264.042357 hartree
zpe.sumelectthermal: -264.037114 hartree
zpe.sumelectthermalent: -264.036170 hartree
zpe.sumelectthermalfe: -264.070534 hartree
dipole: 0.6819 -1.3832 0.0006
dipole: 1.5422
quadrupole: -22.7080 -36.3753 -29.5075
quadrupole: -2.4148 0.0002 -0.0015
quadrupole: 6.8223 -6.8450 0.0227 -2.4148 0.0002 -0.0015
hfenergy: -264.1296267 hartree
pointgroup: C01 [X(C2H6N2O1)]
dipole: 0.2352924 0.5592506 -0.0002187 debye
dipolederiv: -0.4946515 -0.0244109 0.0000082 0.3818751 -0.8161561 0.0000336 0.0003633 -0.0002847 -0.2449428 0.5306145 -0.1887379 -0.0000845 -0.3014627 0.890083 0.0001165 -0.0008106 0.0002046 -0.0012215 -0.4264388 0.2344667 0.0001159 0.2016364 -0.4655617 -0.0001369 0.0000803 0.0000841 -0.2519331 0.0977611 -0.0399048 -0.0000103 -0.0706483 0.0617429 0.0000219 0.0005201 0.0001172 0.1670961 0.1978655 -0.1258318 0.0000018 -0.2423285 0.096839 0.0000204 -0.0000042 -0.00004 0.2096975 0.0531754 -0.0010804 0.0310841 -0.040083 0.064709 -0.0859319 -0.0189585 -0.0852785 -0.0149548 0.0530426 -0.0012212 -0.0310212 -0.0400402 0.0652014 0.0855967 0.0190535 0.0850226 -0.0155324 0.0156969 0.0201394 -0.0001377 0.092764 0.0088417 0.0002774 -0.0002205 0.0001552 0.1382406 0.00644 0.0228261 0.0219012 -0.0610673 0.0490156 -0.1134651 -0.0495279 -0.08147 -0.0502936 -0.0399819 0.0809416 -0.0000098 0.1404773 -0.0037197 0.0000143 -0.0000321 0.0000044 0.1140818 0.0064762 0.0228133 -0.0218476 -0.0611228 0.0490048 0.1134531 0.0495365 0.081485 -0.0502379 unknown
polarizability: 52.760704|-3.3652606|45.3057072|-0.0026784|0.0020107|27.2278454 unknown
InChI: InChI=1S/C2H6N2O/c1-3-4(2)5/h1-2H3
charge 0 multiplicity 1
11 atoms
O  0.361997 -1.360204 -0.000107
N  0.399702 -0.044532 0.000482
N  -0.630908 0.775552 0.000269
C  1.747204 0.621826 -0.000093
C  -1.921911 0.048474 -0.000011
H  1.829417 1.252314 0.897531
H  1.830034 1.249521 -0.899636
H  2.501568 -0.174891 0.001327
H  -2.016937 -0.610175 -0.886771
H  -2.718119 0.806319 -0.000107
H  -2.017247 -0.610306 0.886617
