program: Gaussian 09
title: 000185343
version: EM64L-G09RevD.01
frameworkgroup: C1[X(C11H17N2)]
method: RPBEPBE
basis: SDD
operation: Freq
keyword: #p
keyword: freq=noraman
keyword: PBEPBE/SDD
title: #p freq=noraman PBEPBE/SDD
converged: YES YES NO NO
title: Mulliken charges:
elementType: N N C C C C C C C C C C C H H H H H H H H H H H H H H H H H
charge: -0.186256 -0.058510 -0.194419 -0.478323 -0.445999 -0.376260 0.516820 -0.635525 -0.293410 -0.342121 -0.147928 -0.157499 -0.589587 0.245720 0.230775 0.254790 0.257610 0.238256 0.239621 0.233427 0.219301 0.225105 0.251157 0.322140 0.286315 0.275417 0.288991 0.282681 0.280573 0.257136
chargesum: 1.00000
title: Mulliken charges with hydrogens summed into heavy atoms:
elementType: N N C C C C C C C C C C C
charge: -0.186256 -0.058510 0.051301 0.007242 0.049867 0.096789 0.516820 0.060038 0.028730 -0.055806 0.127489 0.131492 0.230803
polarizability: 2.02959838e+02 9.71227346e+00 1.23608136e+02 3.01274273e+00 -4.63299768e+00 9.25874154e+01
1716.lowfreq: -19.1476 -12.1746 -3.8286 -0.0002 0.0005 0.0005 23.7403 29.1105 64.2771
frequency: 23.0107 27.7454 64.1643 84.5096 105.5923 196.8840 201.1183 209.0883 252.6914 277.3366 295.1271 382.1745 404.3540 427.1033 524.5988 541.9920 560.1113 593.4702 635.6980 686.6522 728.2589 802.4173 815.3419 841.7849 891.3952 896.2053 912.6181 928.0202 942.0544 967.7943 1001.2042 1012.8487 1027.9797 1050.3625 1070.7217 1091.8647 1102.3633 1121.3047 1123.8344 1128.6834 1144.2004 1177.9579 1192.0731 1198.6653 1216.0192 1235.5711 1241.5276 1271.4496 1286.4960 1300.1437 1313.6764 1336.6110 1343.7322 1372.0656 1423.4308 1438.9156 1457.6375 1464.1660 1466.4523 1470.0482 1471.4939 1476.4944 1481.5071 1492.9214 1501.7364 1569.8172 1615.0366 2888.2187 2913.4784 2978.9038 3004.7491 3018.6936 3024.0481 3031.5737 3037.2611 3085.7407 3090.3372 3098.2685 3126.3381 3151.1469 3159.5402 3177.3811 3186.8584 3205.3366
redmass: 1.2430 2.1662 2.3370 3.3228 2.8970 2.2373 2.0644 1.2189 3.1225 2.7800 4.1456 2.8581 2.9278 2.9816 4.8584 4.1903 2.3438 3.3826 5.3074 2.0809 4.0167 2.2442 1.7004 1.8332 1.7256 1.6950 2.0959 2.0932 1.3827 2.4737 1.3844 5.1321 2.0709 2.2062 1.8743 1.9235 1.2967 1.4397 1.4696 1.6679 1.7812 1.5170 2.0923 1.1311 1.9173 1.4342 2.7389 1.3642 1.3531 1.2945 1.3709 1.5346 1.4453 3.6052 1.3423 1.1597 1.7599 1.2165 1.3499 1.0426 1.0521 1.0932 1.0511 1.5155 1.0843 5.2830 5.3369 1.0831 1.0501 1.0588 1.0646 1.0768 1.0338 1.0919 1.0825 1.0994 1.1003 1.1046 1.1041 1.1032 1.0925 1.0943 1.0921 1.1012
irintensity: 0.7029 1.3101 2.9174 3.8939 1.1499 1.6293 0.9355 0.5180 0.7161 8.3663 2.0844 1.9378 1.5630 4.2294 4.5037 0.8887 0.4438 3.4577 2.6389 34.0507 3.6389 16.1615 35.0423 0.6994 6.3070 6.0419 7.3182 0.6542 0.9198 1.8319 0.0959 13.8308 15.7933 16.4238 5.6452 11.7177 2.9289 15.1829 2.5540 14.4612 32.9488 9.4405 19.5417 3.7364 13.0183 5.2278 10.3161 1.0403 4.7045 0.8306 7.0360 5.4365 5.0011 2.2891 19.0589 12.7271 1.2470 11.8953 5.9677 10.5095 26.7640 6.9246 8.9291 51.8329 1.4786 13.7351 43.6984 43.1540 104.3156 66.0546 19.3674 15.0807 3.8948 29.4033 27.5206 15.3356 15.9935 27.6484 1.8049 2.2514 2.3673 3.8149 1.5373 1.8591
temp: 298.150 k
press: 1.00000 atm
elementType: 7 7 6 6 6 6 6 6 6 6 6 6 6 1 1 1 1 1 1 1 1 1 1 1 1 1 1 1 1 1
symmnumber: 1
zpe: 688380.3 jmol-1
zpe.correction: 0.262190 hartree
zpe.thermalcorrener: 0.275206 hartree
zpe.thermalcorrenthalpy: 0.276150 hartree
zpe.thermalcorrgfe: 0.220914 hartree
zpe.sumelectzpe: -537.638483 hartree
zpe.sumelectthermal: -537.625467 hartree
zpe.sumelectthermalent: -537.624523 hartree
zpe.sumelectthermalfe: -537.679759 hartree
dipole: -5.6153 0.4203 -0.3362
dipole: 5.6411
quadrupole: -34.6635 -59.9830 -73.1253
quadrupole: -4.0705 1.0094 -3.3532
quadrupole: 21.2604 -4.0591 -17.2014 -4.0705 1.0094 -3.3532
hfenergy: -537.9006736 hartree
pointgroup: C01 [X(C11H17N2)]
dipole: -2.2038024 0.1990901 0.1709104 debye
polarizability: 203.6704204|5.8467004|111.6816633|2.7812496|15.4989802|103.8033051 unknown
InChI: InChI=1S/C11H17N2/c1-12-7-3-5-10(9-12)11-6-4-8-13(11)2/h3,5,7,9,11H,4,6,8H2,1-2H3
charge 1 multiplicity 1
30 atoms
N  1.858498 -0.073676 0.70015
N  -2.249476 0.6642 0.512303
C  1.205129 -0.465111 -0.573195
C  1.721135 0.601094 -1.586132
C  3.189708 0.798038 -1.138421
C  3.126057 0.680935 0.407206
C  -0.309354 -0.453599 -0.420993
C  1.966625 -1.130154 1.727302
C  -0.890696 0.581289 0.340715
C  -1.16714 -1.419446 -0.998429
C  -2.566933 -1.327803 -0.801611
C  -3.094199 -0.278522 -0.04276
C  -2.844001 1.784323 1.30574
H  1.5198 -1.477916 -0.92216
H  1.147517 1.539948 -1.469037
H  1.621802 0.266831 -2.631883
H  3.603209 1.762583 -1.474672
H  3.822538 -0.003564 -1.559079
H  3.096619 1.67253 0.896212
H  4.004678 0.137527 0.807203
H  0.976773 -1.578422 1.927509
H  2.665435 -1.947065 1.433398
H  2.330246 -0.693048 2.672365
H  -0.252609 1.316108 0.838634
H  -0.74833 -2.241626 -1.587922
H  -3.249469 -2.067562 -1.226168
H  -4.162216 -0.157803 0.149545
H  -3.495863 2.39138 0.657337
H  -3.430126 1.37385 2.143184
H  -2.039657 2.417683 1.704861
