program: Gaussian 09
title: 000185341
version: EM64L-G09RevD.01
frameworkgroup: C1[X(C20H20O4)]
method: RPBEPBE
basis: SDD
operation: Freq
keyword: #pfreq=noraman
keyword: PBEPBE/SDD
title: #p freq=noraman PBEPBE/SDD
converged: YES YES NO NO
title: Mulliken charges:
elementType: O O O O C C C C C C C C C C C C C C C C C C C C H H H H H H H H H H H H H H H H H H H H
charge: -0.283389 -0.192076 -0.246304 -0.379416 -0.192493 -0.547201 0.092140 0.103035 0.296712 0.467670 0.209107 -0.595685 0.411477 -0.434156 -0.379634 -0.607300 -0.225603 -0.226927 -0.238955 -0.366425 -0.326045 0.401750 -0.778190 -0.788087 0.234018 0.255651 0.253567 0.282282 0.233379 0.258242 0.245156 0.227102 0.225907 0.228938 0.215809 0.215045 0.355278 0.235811 0.219185 0.224948 0.234713 0.226364 0.226120 0.228479
chargesum: 0.00000
title: Mulliken charges with hydrogens summed into heavy atoms:
elementType: O O O O C C C C C C C C C C C C C C C C C C C C
charge: -0.283389 -0.192076 -0.246304 -0.024138 0.041525 -0.037982 0.092140 0.103035 0.296712 0.467670 0.209107 -0.313403 0.411477 -0.200777 -0.121392 -0.362144 0.001499 -0.001020 -0.010017 0.064429 -0.090235 0.401750 -0.099344 -0.107124
polarizability: 3.63450006e+02 6.71658672e-01 2.29650483e+02 -1.67961421e+00 1.45949092e+01 1.54476788e+02
1716.lowfreq: -9.0658 -3.0226 -0.0005 0.0004 0.0006 5.1459 13.3631 19.2797 27.8555
frequency: 11.8799 19.2341 27.8036 35.7724 46.8903 64.6873 71.7687 87.4357 109.3625 126.3395 151.5281 172.9538 186.1217 205.7797 218.4196 229.3332 249.9436 276.2430 283.2903 296.3246 305.5715 365.3788 375.7849 400.8301 405.0625 414.9194 437.2614 457.0855 482.2965 485.7588 520.5662 534.1864 566.6159 581.8538 592.9680 604.2630 614.5804 628.3017 641.4503 672.9326 695.5305 706.1083 741.9615 770.5727 782.9077 794.5700 839.7223 846.7026 855.9677 861.1333 871.0398 906.4958 924.0389 947.4051 957.8456 979.4592 979.9881 990.1753 991.8376 997.4195 1004.5600 1023.9015 1030.4237 1034.6350 1044.2905 1063.7580 1083.5022 1083.9246 1128.1924 1142.2080 1164.7378 1173.0821 1176.4990 1187.3681 1189.1676 1210.3219 1219.2391 1243.2872 1249.7031 1274.6423 1304.2672 1316.2763 1323.2075 1344.2056 1352.1007 1378.0238 1386.7035 1388.3986 1389.5571 1400.6371 1425.7395 1429.1996 1442.0764 1454.2709 1459.6819 1472.0859 1472.1998 1481.0624 1485.0671 1488.1043 1563.8797 1592.0911 1595.4440 1616.5572 1628.4075 1697.9856 2958.2713 2965.0682 2969.2678 2972.5239 2995.4774 3033.8690 3038.8261 3043.5834 3083.5925 3087.3683 3097.4591 3115.1850 3116.4586 3127.9790 3141.4349 3147.3856 3155.7556 3167.3859 3191.8862 3539.8875
redmass: 3.7483 3.2940 5.0689 5.0861 4.0238 5.7114 4.1349 4.0113 4.2353 1.0612 2.6002 5.0023 1.5574 4.1799 4.2245 5.5393 4.8907 6.0699 4.0004 4.3084 2.6310 4.4014 2.8759 2.8340 1.1952 3.8387 4.5504 2.5712 3.7506 4.0436 3.9045 3.7333 4.1485 5.0229 4.0939 4.4094 6.3330 4.2969 3.3461 5.1370 4.1818 1.7588 2.9852 1.8851 2.3792 2.1642 3.3042 2.3496 1.2603 1.7061 3.1218 4.0160 1.4426 1.3936 3.2153 1.3903 1.6752 6.1270 1.2625 1.3196 3.9694 2.8568 3.2553 5.1006 1.6960 3.3354 1.6009 1.6977 2.0870 2.3973 1.4500 1.0532 1.3820 1.1123 1.3476 1.8963 1.9747 1.6973 1.4188 2.4658 1.4861 1.6788 1.6548 1.7789 1.7488 1.5340 4.9569 2.9742 1.7644 1.2305 1.4803 2.0608 2.2049 1.0509 1.0784 1.0749 1.0721 1.8666 2.0852 1.6450 7.2999 8.0653 6.3100 6.0976 7.9702 6.3429 1.0596 1.0373 1.0835 1.0389 1.0651 1.1013 1.0969 1.0962 1.0970 1.0990 1.0959 1.0902 1.0873 1.0868 1.0922 1.0904 1.0959 1.1004 1.0926 1.0657
irintensity: 0.3551 0.4028 0.2055 2.0905 0.4453 0.6189 0.1267 6.2395 1.6880 0.3549 3.5356 0.4724 0.4802 0.3058 0.8377 2.5718 2.0894 3.2653 10.3539 4.6820 0.1711 4.7288 3.2582 0.9417 98.0591 9.9543 8.0141 3.1013 4.6157 18.4490 1.7603 8.5940 13.8182 40.8592 0.6233 16.3583 0.1185 6.0723 4.6124 14.5090 6.7476 46.5893 21.2337 51.5131 20.7505 17.2771 14.7763 6.5731 0.9095 45.8008 18.9832 72.1124 3.9286 0.4159 39.2779 0.0618 2.0232 2.0142 14.9915 0.7390 109.5077 139.4607 116.8501 39.8260 23.2117 66.5271 8.8757 5.6466 478.9608 16.4617 47.2693 0.1506 57.5259 1.3427 4.4899 91.0872 3.9739 14.0390 42.6322 166.4292 92.4481 21.8347 35.2860 29.7864 32.3020 21.1794 72.7348 50.8917 67.5225 16.9061 35.3246 46.9628 13.9626 1.5792 6.0013 17.0620 14.5385 33.4066 12.2623 19.8354 62.3375 563.1019 67.4345 5.2632 540.9854 25.3005 30.2849 32.8786 20.4536 41.6061 10.2162 26.3031 6.6004 37.3246 9.0688 23.5656 35.1099 25.2215 7.6984 0.4997 25.1609 11.0473 34.2376 15.4980 0.1907 23.4392
temp: 298.150 k
press: 1.00000 atm
elementType: 8 8 8 8 6 6 6 6 6 6 6 6 6 6 6 6 6 6 6 6 6 6 6 6 1 1 1 1 1 1 1 1 1 1 1 1 1 1 1 1 1 1 1 1
symmnumber: 1
zpe: 914921.9 jmol-1
zpe.correction: 0.348475 hartree
zpe.thermalcorrener: 0.371243 hartree
zpe.thermalcorrenthalpy: 0.372187 hartree
zpe.thermalcorrgfe: 0.292939 hartree
zpe.sumelectzpe: -1073.258110 hartree
zpe.sumelectthermal: -1073.235342 hartree
zpe.sumelectthermalent: -1073.234398 hartree
zpe.sumelectthermalfe: -1073.313646 hartree
dipole: 4.9333 -2.1296 0.3885
dipole: 5.3873
quadrupole: -97.1584 -153.6234 -136.1569
quadrupole: 15.9358 -0.5746 2.7298
quadrupole: 31.8212 -24.6438 -7.1773 15.9358 -0.5746 2.7298
hfenergy: -1073.606585 hartree
pointgroup: C01 [X(C20H20O4)]
dipole: 1.9250762 -0.8734054 0.154005 debye
polarizability: 363.3355477|-2.0447331|230.5738126|-4.3545534|12.1197884|153.6679172 unknown
InChI: InChI=1S/C20H20O4/c1-13(2)8-9-23-15-10-16(21)20-17(22)12-18(24-19(20)11-15)14-6-4-3-5-7-14/h3-8,10-11,18,21H,9,12H2,1-2H3
charge 0 multiplicity 1
44 atoms
O  -1.507055 -0.515434 -0.055929
O  -1.728308 3.674568 -0.228967
O  3.205481 -0.705406 -0.40343
O  1.012748 3.690864 -0.249596
C  -2.706309 0.221792 0.441315
C  -2.85442 1.524745 -0.363862
C  -0.324784 1.673042 -0.179863
C  -1.606523 2.415065 -0.237119
C  -0.328255 0.232264 -0.154661
C  -3.900148 -0.704189 0.31922
C  0.961683 2.296922 -0.24732
C  0.847067 -0.529598 -0.237777
C  2.09219 0.130875 -0.332903
C  -4.93639 -0.638436 1.28243
C  -4.025802 -1.593758 -0.776315
C  2.157495 1.547772 -0.327282
C  -6.092072 -1.439738 1.147319
C  -5.176502 -2.40214 -0.906073
C  -6.215343 -2.32442 0.051273
C  4.552264 -0.070519 -0.531689
C  5.549646 -1.174796 -0.720971
C  6.596487 -1.48433 0.098075
C  7.533713 -2.627246 -0.254251
C  6.939926 -0.763574 1.389414
H  -2.519152 0.468468 1.507877
H  -3.731134 2.099823 -0.021032
H  -3.01534 1.274252 -1.431648
H  0.800959 -1.619746 -0.208613
H  -4.84011 0.039097 2.140317
H  -3.211238 -1.663489 -1.504307
H  3.117295 2.072699 -0.375365
H  -6.888319 -1.380434 1.897669
H  -5.263162 -3.093958 -1.751524
H  -7.108019 -2.951446 -0.052136
H  4.529566 0.597958 -1.417915
H  4.753831 0.537373 0.370155
H  1.950971 3.999255 -0.341962
H  5.392867 -1.778715 -1.624845
H  8.580366 -2.272982 -0.334941
H  7.521348 -3.399742 0.539582
H  7.257763 -3.108382 -1.207644
H  7.92497 -0.263284 1.306301
H  6.198187 -0.004093 1.684565
H  7.025165 -1.491882 2.218924
