program: Gaussian 09
title: 000185334
version: EM64L-G09RevD.01
frameworkgroup: C1[X(C16H18N2O4)]
method: RPBEPBE
basis: SDD
operation: Freq
keyword: #p
keyword: freq=noraman
keyword: PBEPBE/SDD
title: #p freq=noraman PBEPBE/SDD
converged: YES YES NO NO
title: Mulliken charges:
elementType: O O O O N N C C C C C C C C C C C C C C C C H H H H H H H H H H H H H H H H H H
charge: -0.259419 -0.262421 -0.213098 -0.242510 -0.278482 0.001412 -0.162035 0.100094 0.397718 0.413278 -0.737549 0.199817 0.271347 -0.395811 -0.439285 -0.853303 -0.831205 -0.226886 0.166235 -0.334132 -0.284382 -0.502746 0.273533 0.247652 0.243503 0.247870 0.235115 0.233952 0.292679 0.217863 0.250580 0.236314 0.247717 0.232348 0.224385 0.291486 0.274720 0.232904 0.251735 0.239008
chargesum: 0.00000
title: Mulliken charges with hydrogens summed into heavy atoms:
elementType: O O O O N N C C C C C C C C C C C C C C C C
charge: -0.259419 -0.262421 -0.213098 -0.242510 -0.278482 0.001412 0.111498 0.100094 0.397718 0.413278 0.001476 0.199817 0.271347 -0.160696 -0.205333 -0.092181 -0.114826 -0.002502 0.166235 -0.042646 -0.009662 0.220902
polarizability: 2.25313023e+02 -1.26611278e+01 2.01150646e+02 9.58979946e+00 -2.67701865e+00 1.66843520e+02
1716.lowfreq: -8.1959 -4.0464 -0.0008 -0.0008 -0.0002 2.8563 15.9863 36.7880 42.8811
frequency: 14.9803 36.6466 42.8182 55.2539 58.0915 68.0459 75.3467 89.0019 108.3502 116.5030 124.7394 135.5751 152.8931 172.6109 192.1192 210.4177 221.6543 230.5271 248.9786 272.9754 296.0852 322.0309 333.4851 350.8529 371.7441 386.9891 473.1418 481.0149 508.8479 522.2554 545.4069 577.4965 584.3378 603.4206 620.7531 667.4417 685.3491 733.8449 742.9043 757.4954 770.8830 784.4288 804.6772 823.0378 834.6705 888.8827 898.3062 899.3305 920.0346 931.5594 942.4162 953.0004 982.8708 989.5239 1017.1308 1038.6382 1040.0799 1042.6564 1046.4411 1088.3559 1097.0158 1111.7598 1115.7541 1142.2928 1149.9728 1151.7375 1162.4029 1179.6311 1233.7657 1258.9674 1271.0659 1277.8593 1297.0838 1338.2519 1349.3232 1365.7721 1393.2840 1401.5392 1406.9895 1418.7138 1421.8807 1439.5477 1452.5023 1455.6855 1464.3232 1466.4907 1472.2828 1474.5319 1479.7055 1483.0348 1492.7781 1527.5041 1556.0432 1600.2047 1602.0050 1646.7698 2973.2432 2977.2912 3004.5064 3006.1275 3017.6445 3051.5789 3055.8217 3088.0542 3092.6920 3103.6635 3109.9040 3110.7804 3121.9662 3132.4066 3151.0857 3156.3581 3217.3902 3264.3634
redmass: 5.7297 3.4665 5.1056 3.7785 3.1570 3.5419 1.4500 1.1342 3.2188 5.0654 2.0900 1.5635 3.5360 4.4964 5.1199 6.4841 2.8487 3.0545 1.3041 2.9920 3.4494 3.6936 3.6850 4.9260 4.6092 5.8968 6.7923 4.2271 3.9592 3.1185 5.5725 5.5587 8.1225 3.9120 3.6060 4.4696 5.9187 5.9994 6.2665 4.2391 10.7475 1.2316 3.6497 5.7598 1.2520 6.1146 1.4292 1.3120 2.6900 6.8790 5.7987 2.4765 1.3402 1.6322 1.5401 1.7540 1.7169 1.5944 1.5702 1.9808 2.7908 1.8188 1.4927 2.8179 2.3490 1.7867 1.9560 1.1602 4.3207 1.6109 3.5269 2.8113 1.9719 1.3963 5.6751 7.6745 1.2080 1.2228 1.2100 4.3707 1.2073 2.1820 1.0502 1.9273 1.0507 1.0479 1.0525 1.1085 1.0763 1.3616 1.1525 11.0180 7.5634 7.4523 5.7196 8.7657 1.0398 1.0378 1.0354 1.0295 1.0840 1.0968 1.0934 1.0983 1.1009 1.1000 1.1046 1.1006 1.0856 1.0919 1.1050 1.0995 1.0953 1.1024
irintensity: 3.6934 0.6456 2.1316 2.4120 1.0058 1.0797 1.0382 0.8294 1.4172 1.9405 2.0452 0.4982 0.2619 2.1993 4.4989 0.2287 0.0805 8.1713 3.2278 5.1239 16.3342 8.3805 9.6203 4.1071 8.0825 23.0786 0.1241 0.0424 0.4494 0.3668 1.7372 1.2243 0.2644 3.5069 12.9827 7.9172 8.3852 20.4380 3.7252 1.5633 5.8751 50.8146 4.0445 7.8021 53.3552 6.5212 0.8798 0.2369 1.9234 15.2284 6.1174 4.5355 0.1085 3.4625 18.9249 14.4809 2.5753 17.5798 8.7122 19.7492 7.3882 120.8634 47.5097 157.7396 13.7649 72.6986 9.7722 2.3810 24.7075 0.5427 20.1262 23.4639 15.1327 36.9070 252.0673 4.0989 15.4768 15.2833 12.7884 2.7588 16.5853 9.9970 15.2419 1.0514 10.3520 14.0218 24.2676 11.4908 15.4348 25.2658 23.9535 210.1900 19.5114 6.7649 5.4701 151.0084 23.0418 23.9564 13.8161 37.8611 5.0537 18.0566 20.5958 24.2266 6.7630 21.1999 20.1060 13.9260 0.0571 22.3968 17.2306 34.1960 0.8315 3.0742
temp: 298.150 k
press: 1.00000 atm
elementType: 8 8 8 8 7 7 6 6 6 6 6 6 6 6 6 6 6 6 6 6 6 6 1 1 1 1 1 1 1 1 1 1 1 1 1 1 1 1 1 1
symmnumber: 1
zpe: 817544.1 jmol-1
zpe.correction: 0.311386 hartree
zpe.thermalcorrener: 0.333826 hartree
zpe.thermalcorrenthalpy: 0.334770 hartree
zpe.thermalcorrgfe: 0.257799 hartree
zpe.sumelectzpe: -1029.242403 hartree
zpe.sumelectthermal: -1029.219964 hartree
zpe.sumelectthermalent: -1029.219019 hartree
zpe.sumelectthermalfe: -1029.295990 hartree
dipole: -1.0188 -1.2619 -1.5387
dipole: 2.2356
quadrupole: -121.8228 -114.6526 -126.9538
quadrupole: 0.9286 -2.6465 0.0739
quadrupole: -0.6797 6.4905 -5.8108 0.9286 -2.6465 0.0739
hfenergy: -1029.5537891 hartree
pointgroup: C01 [X(C16H18N2O4)]
dipole: 0.4507687 -0.4899078 0.5747889 debye
polarizability: 220.3471645|14.3876817|204.1816441|12.3233556|8.2544309|168.7783803 unknown
InChI: InChI=1S/C16H18N2O4/c1-10-6-5-7-11(2)14(10)18(12(3)16(20)21-4)15(19)13-8-9-17-22-13/h5-9,12H,1-4H3
charge 0 multiplicity 1
40 atoms
O  4.000912 0.331833 0.716817
O  1.1374 1.859924 1.057291
O  -2.20122 1.026103 -0.2295
O  2.789583 0.51832 -1.263279
N  0.450558 -0.244637 0.362086
N  -3.33335 1.960311 -0.343896
C  1.838353 -0.692674 0.705045
C  -0.566513 -1.215512 -0.019314
C  -0.816533 -1.479584 -1.393362
C  -1.271163 -1.889972 1.019675
C  2.081391 -2.187546 0.411799
C  0.214261 1.101145 0.604404
C  2.874008 0.143471 -0.07332
C  -1.778667 -2.471244 -1.711913
C  -2.228303 -2.866194 0.658043
C  -0.136285 -0.696658 -2.498524
C  -1.024017 -1.556952 2.480477
C  -2.477615 -3.160674 -0.70062
C  -1.121044 1.711363 0.348813
C  -1.497137 3.022851 0.609746
C  -2.856011 3.119437 0.169073
C  5.100691 1.103888 0.088906
H  2.021339 -0.481061 1.775155
H  1.950886 -2.415815 -0.659203
H  3.115655 -2.43797 0.703718
H  1.393082 -2.826981 0.987974
H  -1.983773 -2.689085 -2.766565
H  -2.781315 -3.391778 1.445059
H  0.87626 -0.357176 -2.223697
H  -0.077049 -1.293018 -3.425715
H  -0.726752 0.211751 -2.730553
H  0.034193 -1.698007 2.770478
H  -1.276632 -0.503326 2.703756
H  -1.639642 -2.195175 3.136239
H  -3.21973 -3.921266 -0.9679
H  -0.868274 3.791237 1.049326
H  -3.519632 3.98364 0.196849
H  5.90477 1.106476 0.837667
H  4.756062 2.128223 -0.128768
H  5.425154 0.620035 -0.847771
