program: Gaussian 09
title: 000185330
version: EM64L-G09RevD.01
frameworkgroup: C1[X(C16H22O3)]
method: RPBEPBE
basis: SDD
operation: Freq
keyword: #pfreq=noraman
keyword: PBEPBE/SDD
title: #p freq=noraman PBEPBE/SDD
converged: YES YES NO NO
title: Mulliken charges:
elementType: O O O C C C C C C C C C C C C C C C C H H H H H H H H H H H H H H H H H H H H H H
charge: -0.297916 -0.297292 -0.276336 0.241262 0.196411 0.193562 -0.231999 -0.720058 -0.698070 -0.309829 0.058723 0.454803 -0.583775 0.224224 -0.387090 -0.623775 -0.719752 -0.691437 -0.530807 0.227259 0.201432 0.229978 0.238671 0.225064 0.213456 0.241626 0.264117 0.190860 0.265232 0.211565 0.190982 0.261393 0.225147 0.251792 0.212125 0.242302 0.203869 0.214081 0.222789 0.223830 0.241581
chargesum: 0.00000
title: Mulliken charges with hydrogens summed into heavy atoms:
elementType: O O O C C C C C C C C C C C C C C C C
charge: -0.297916 -0.297292 -0.276336 0.241262 0.196411 0.193562 -0.004741 -0.049977 -0.017924 -0.045712 0.249582 0.454803 -0.318543 0.224224 0.015458 -0.362382 -0.030688 -0.031185 0.157393
polarizability: 2.63871409e+02 -1.00087415e+01 2.04191468e+02 2.84831858e+00 9.48877424e-01 1.24758352e+02
1716.lowfreq: -6.6427 -4.3107 -0.0005 0.0002 0.0005 8.1222 35.3654 41.5965 54.6897
frequency: 35.3327 41.5572 54.6879 81.8386 91.2858 98.4002 108.4056 156.5689 178.1671 192.5220 197.4610 198.4670 214.6071 221.6403 231.8352 247.5803 256.5464 269.2483 284.2377 306.4178 338.2128 354.6242 364.7546 406.0117 412.7819 457.7450 473.8939 490.4126 531.1021 544.5480 560.4295 598.8745 625.4055 633.5595 695.0549 702.0068 714.9291 770.3328 772.4731 814.1263 817.5272 825.2659 840.5183 862.5103 865.8697 916.0170 933.8736 946.1653 965.8671 968.0075 992.1096 995.3869 1009.5667 1039.3496 1071.6722 1107.3898 1113.3062 1114.7781 1121.6390 1125.1069 1160.3188 1166.0611 1180.6188 1197.1700 1220.3540 1224.0152 1250.8580 1263.1251 1297.1973 1302.8016 1336.8360 1360.8013 1366.7004 1371.3657 1385.0375 1387.4808 1389.0253 1396.7702 1423.4406 1447.8546 1451.0166 1452.0711 1458.8870 1465.1166 1465.7110 1466.2077 1471.7140 1475.0524 1479.4759 1481.1160 1487.0339 1488.1719 1573.1361 1612.9647 1640.6636 2962.4100 2969.7942 2980.9764 2981.2578 2985.5067 2989.9049 2993.4590 3040.8584 3050.7994 3073.8581 3080.6081 3084.1476 3091.0953 3093.5771 3093.6545 3094.0142 3104.0583 3123.8440 3130.0385 3167.7661 3184.0408 3187.0011
redmass: 3.3870 3.2918 3.1948 3.6769 3.7321 3.4017 2.0426 2.7652 2.6679 1.4982 1.0248 1.3529 1.9424 2.1678 2.2868 1.3660 2.0438 1.7508 2.9875 3.2199 3.4223 3.0416 3.0415 3.5455 3.1114 3.9672 3.2461 3.9833 4.6231 3.8597 5.6985 4.5731 3.2757 5.1895 2.3758 3.8718 2.7386 1.9030 2.1236 1.6635 2.8804 1.8831 2.1565 2.4072 2.7960 1.5617 3.0736 2.2374 1.2989 1.3985 1.5497 1.3143 2.8912 3.2645 5.3511 1.5838 1.7886 1.2634 2.2826 2.4116 1.4519 1.9077 2.0289 1.8917 2.0710 1.9964 2.4395 1.2121 1.4578 2.6881 1.4559 1.6412 1.6975 1.4511 1.2742 1.2151 1.5920 2.1352 2.3644 1.5278 1.0645 1.0968 1.0567 1.1112 1.0797 1.0979 1.2047 1.0447 1.0509 1.0733 1.1323 1.8084 8.7900 7.9896 7.5630 1.0326 1.0829 1.0374 1.0346 1.0465 1.0500 1.0353 1.1003 1.1039 1.0995 1.0997 1.0989 1.1007 1.0994 1.0999 1.1000 1.1006 1.0999 1.0872 1.0978 1.0911 1.0907
irintensity: 1.3174 0.5846 1.3823 0.3236 1.5971 4.8155 0.3693 1.4483 1.5130 1.1503 0.0468 1.5424 0.8754 0.4247 0.8806 0.0830 0.1197 0.6006 0.3790 7.7539 4.3193 2.3106 1.3711 1.0700 1.5798 1.0455 4.7880 8.2510 0.7164 2.4367 2.2098 4.6805 13.3225 6.6412 9.4872 1.6847 9.3318 9.4794 26.6903 2.6489 11.4179 2.7347 59.5480 15.4706 2.0203 1.1382 9.1923 3.9271 2.2157 9.4778 8.0668 3.2203 170.5161 9.5743 238.1050 155.2974 23.9725 2.0885 23.0954 238.4784 37.4594 23.3487 45.9993 33.7745 29.3894 15.6964 28.4671 3.3335 21.4818 67.4733 20.5944 3.5950 40.0457 38.6239 14.7299 27.6863 24.8006 5.2671 38.9019 30.1652 6.0084 6.0656 4.1363 11.1800 12.1207 15.0266 51.1244 15.8759 7.3199 8.8975 40.5244 31.0251 137.8386 413.7285 73.2915 70.2094 17.8101 31.5037 27.2084 3.8857 53.3275 26.4431 12.7059 45.0236 49.9756 8.8990 29.0842 23.5465 15.8938 62.2275 31.0205 29.5838 23.9181 3.8877 15.3364 4.6676 2.8071
temp: 298.150 k
press: 1.00000 atm
elementType: 8 8 8 6 6 6 6 6 6 6 6 6 6 6 6 6 6 6 6 1 1 1 1 1 1 1 1 1 1 1 1 1 1 1 1 1 1 1 1 1 1
symmnumber: 1
zpe: 899704.5 jmol-1
zpe.correction: 0.342679 hartree
zpe.thermalcorrener: 0.362998 hartree
zpe.thermalcorrenthalpy: 0.363943 hartree
zpe.thermalcorrgfe: 0.294379 hartree
zpe.sumelectzpe: -847.098139 hartree
zpe.sumelectthermal: -847.077820 hartree
zpe.sumelectthermalent: -847.076876 hartree
zpe.sumelectthermalfe: -847.146440 hartree
dipole: -1.0080 0.0924 0.3640
dipole: 1.0757
quadrupole: -101.7814 -100.1684 -117.4994
quadrupole: -0.1974 2.3498 -1.0244
quadrupole: 4.7017 6.3147 -11.0163 -0.1974 2.3498 -1.0244
hfenergy: -847.4408181 hartree
pointgroup: C01 [X(C16H22O3)]
dipole: 0.3860511 -0.0049049 0.173332 debye
polarizability: 262.4499198|-11.3789892|196.6516904|8.0749334|-25.3292598|133.7196189 unknown
InChI: InChI=1S/C16H22O3/c1-6-11(2)18-12-9-14(17-5)13-7-8-16(3,4)19-15(13)10-12/h7-11H,6H2,1-5H3
charge 0 multiplicity 1
41 atoms
O  -1.714843 1.509992 -1.113035
O  2.70419 -0.323584 -0.125792
O  -1.280564 -2.964519 0.681542
C  -3.172659 1.565555 -0.689632
C  -0.925698 0.469132 -0.605771
C  -1.518036 -0.749122 -0.175567
C  -3.753441 0.159962 -0.609155
C  -3.838198 2.414323 -1.783836
C  -3.218638 2.264206 0.690414
C  -2.963786 -0.911868 -0.311256
C  3.412826 0.884993 -0.637643
C  1.305647 -0.386245 -0.18859
C  0.471557 0.665965 -0.63243
C  -0.641271 -1.784287 0.266931
C  4.802341 0.846587 0.021035
C  0.756554 -1.613424 0.268107
C  3.474093 0.84716 -2.173862
C  4.756578 1.015951 1.553114
C  -0.433417 -4.07746 1.11279
H  -4.833861 0.055611 -0.761533
H  -4.904977 2.575032 -1.544512
H  -3.342081 3.397389 -1.857867
H  -3.766176 1.909149 -2.761568
H  -2.775348 3.274312 0.624959
H  -4.264186 2.355847 1.037276
H  -2.66018 1.675214 1.438617
H  -3.380657 -1.916467 -0.195621
H  2.86681 1.785638 -0.285851
H  0.85437 1.622892 -0.991966
H  5.281777 -0.116288 -0.241916
H  5.416997 1.648283 -0.434171
H  1.446387 -2.388443 0.608124
H  4.050688 -0.03377 -2.50814
H  2.467354 0.789809 -2.621365
H  3.971734 1.756235 -2.5590
H  4.135959 0.22544 2.008901
H  4.32285 1.994516 1.834158
H  5.769612 0.957159 1.990684
H  0.168979 -3.801956 1.999994
H  0.239134 -4.409517 0.298223
H  -1.131516 -4.886504 1.373912
