program: Gaussian 09
title: 000185312
version: EM64L-G09RevD.01
frameworkgroup: C1[X(C14H16ClN3OS)]
method: RPBEPBE
basis: SDD
operation: Freq
keyword: #p
keyword: freq=noraman
keyword: PBEPBE/SDD
title: #p freq=noraman PBEPBE/SDD
converged: YES YES NO NO
title: Mulliken charges:
elementType: Cl S O N N N C C C C C C C C C C C C C C H H H H H H H H H H H H H H H H
charge: -0.035750 0.253374 -0.153117 -0.207077 0.018545 -0.096288 0.292278 -0.620188 -0.713393 -0.713131 -0.703201 0.302934 -0.226284 -0.194429 -0.228186 -0.132404 -0.203712 -0.184910 -0.289671 -0.100193 0.292566 0.253391 0.203672 0.219384 0.223309 0.269900 0.205996 0.229500 0.225418 0.196881 0.262515 0.267197 0.285393 0.262717 0.264660 0.272303
chargesum: 0.00000
title: Mulliken charges with hydrogens summed into heavy atoms:
elementType: Cl S O N N N C C C C C C C C C C C C C C
charge: -0.035750 0.253374 -0.153117 -0.207077 0.018545 -0.096288 0.292278 -0.327621 -0.036946 -0.013926 -0.051402 0.302934 -0.226284 0.068087 0.039011 0.152989 0.059005 0.079750 -0.017368 -0.100193
polarizability: 2.73684537e+02 -1.36634887e+01 1.89692109e+02 1.61015165e+01 1.11822544e+01 1.46557786e+02
1716.lowfreq: -7.4878 -5.1385 -0.0022 -0.0016 0.0021 4.5543 18.9060 24.6883 33.2307
frequency: 17.6341 24.1261 32.8292 43.9273 62.9237 83.5688 107.4889 139.1248 148.6520 157.4020 186.6408 203.0720 216.5908 235.6940 249.8255 263.3299 284.6519 294.0978 312.6615 319.4980 333.5287 345.2304 389.4065 407.0546 409.9482 474.7448 487.3505 495.7604 511.7963 597.8839 619.2606 642.4639 656.5191 698.6395 715.0800 728.9507 759.8137 794.7408 802.7820 824.2156 833.1195 859.3821 892.0873 903.3240 924.0634 930.7347 932.5240 950.5301 954.5276 967.8684 991.4974 1001.7319 1027.2168 1036.4799 1065.6354 1072.7754 1100.9661 1102.3705 1135.3330 1150.8618 1171.1671 1180.7643 1214.2060 1220.4861 1243.5606 1252.3670 1283.2027 1285.0741 1329.6516 1337.1205 1353.2884 1376.4712 1379.8086 1381.7299 1406.2362 1433.5271 1454.8454 1458.1173 1469.6342 1471.0678 1482.6982 1487.5342 1503.1504 1572.6549 1573.3475 1647.9609 2966.4224 2976.2550 2985.5885 3059.1275 3062.5012 3068.3978 3071.7288 3082.2861 3094.9348 3112.0499 3146.0379 3156.9103 3172.4201 3179.3965 3253.8339 3260.5921
redmass: 8.4007 4.7810 5.1736 6.0561 5.2941 3.0663 7.1455 6.7296 5.3554 6.3219 2.7334 1.7534 4.2602 3.0926 1.1805 1.4490 2.2616 2.9245 4.3221 4.9832 6.4999 6.5627 2.6498 2.8406 2.7895 2.8956 3.8657 4.9205 7.2910 5.7426 7.1111 4.4692 3.7885 4.1079 7.1543 5.5700 5.4903 4.7020 1.5035 1.3655 1.3435 1.3951 2.8623 6.5983 6.6484 1.6743 1.6795 1.3221 1.2091 1.3671 5.4051 2.2668 1.4344 1.6321 6.7701 1.9748 1.5856 2.4020 1.3204 3.5152 2.0940 1.1298 2.1480 2.8969 2.3712 2.6460 1.4853 1.8704 1.9540 3.6111 4.5999 1.2006 1.2010 3.8695 1.2061 3.8735 2.1193 1.0479 1.0535 1.0523 1.0566 1.0545 1.0604 7.7376 6.2712 10.3426 1.0369 1.0368 1.0373 1.0885 1.0952 1.0971 1.0985 1.0990 1.0995 1.0987 1.0896 1.0895 1.0963 1.0974 1.0963 1.1024
irintensity: 0.2073 0.1248 0.7456 0.1134 0.4293 0.1355 0.1762 0.0771 1.9078 0.7571 0.7938 1.1923 0.2766 5.3521 0.0703 0.3449 0.8772 0.4726 1.2490 2.7596 1.6495 2.9202 0.0467 0.3956 0.2273 2.6690 19.6676 8.1079 18.2134 0.9422 0.0526 15.3645 15.1904 0.1580 10.4315 11.2810 23.1383 53.5976 17.9916 27.5264 32.3777 14.7796 45.2376 2.8271 54.2781 1.0239 3.6332 0.1934 0.0420 0.4574 63.7510 19.1546 0.3855 2.2486 13.7552 41.0007 20.3562 12.5814 27.0382 81.6467 87.1753 3.3003 15.6809 2.6456 19.2505 138.0460 11.5572 15.2317 57.6688 9.3193 0.7814 23.4144 31.1732 9.8959 33.4268 38.9519 90.3112 0.5499 0.4019 2.7973 20.9561 15.4458 32.1161 1.0502 19.0013 202.7601 22.4901 31.7879 23.2560 1.6006 12.3975 33.2793 43.0506 60.0313 17.1150 8.5544 1.7239 0.8024 2.3062 0.8332 0.8124 1.2759
temp: 298.150 k
press: 1.00000 atm
elementType: 17 16 8 7 7 7 6 6 6 6 6 6 6 6 6 6 6 6 6 6 1 1 1 1 1 1 1 1 1 1 1 1 1 1 1 1
symmnumber: 1
zpe: 720930.1 jmol-1
zpe.correction: 0.274588 hartree
zpe.thermalcorrener: 0.294820 hartree
zpe.thermalcorrenthalpy: 0.295764 hartree
zpe.thermalcorrgfe: 0.223396 hartree
zpe.sumelectzpe: -1639.182722 hartree
zpe.sumelectthermal: -1639.162490 hartree
zpe.sumelectthermalent: -1639.161546 hartree
zpe.sumelectthermalfe: -1639.233914 hartree
dipole: -0.6304 -3.3726 -1.8495
dipole: 3.8978
quadrupole: -145.9451 -134.0452 -132.5401
quadrupole: -8.0734 -10.9864 6.3453
quadrupole: -8.4349 3.4649 4.9700 -8.0734 -10.9864 6.3453
hfenergy: -1639.4573099 hartree
pointgroup: C01 [X(C14H16Cl1N3O1S1)]
dipole: -0.1930186 1.1092921 -1.0410783 debye
polarizability: 270.1516649|0.2039749|177.7500132|-28.1903341|-23.3068234|162.0327535 unknown
InChI: InChI=1S/C14H16ClN3OS/c1-14(2,3)12(13(19)18-9-16-8-17-18)20-11-6-4-10(15)5-7-11/h4-9,12H,1-3H3
charge 0 multiplicity 1
36 atoms
Cl 5.075721 1.457252 -1.573159
S  -0.76106 1.350233 1.203409
O  -2.671388 -1.496161 1.680057
N  -0.700256 -2.091937 0.5636
N  -0.610351 -3.30823 1.279404
N  1.115188 -3.127812 -0.275654
C  -3.15827 0.719648 -0.337543
C  -1.767478 0.131077 0.065497
C  -3.943916 -0.387971 -1.100109
C  -3.984511 1.202974 0.883703
C  -2.914759 1.914842 -1.298037
C  -1.803045 -1.181924 0.844286
C  0.880371 1.338719 0.369291
C  1.042665 1.866349 -0.935987
C  2.004094 0.856016 1.08246
C  0.354506 -2.023919 -0.358283
C  2.320864 1.895018 -1.536787
C  3.289999 0.896807 0.496838
C  0.488313 -3.875705 0.733892
C  3.426624 1.411145 -0.807174
H  -1.151653 0.036117 -0.843806
H  -4.199126 -1.232236 -0.437555
H  -3.368907 -0.775033 -1.963645
H  -4.887574 0.034811 -1.489717
H  -3.460543 2.01143 1.42638
H  -4.182256 0.378961 1.587309
H  -4.951453 1.608419 0.532989
H  -2.327883 2.710632 -0.804548
H  -3.883216 2.347716 -1.606578
H  -2.382143 1.595443 -2.215476
H  0.182439 2.273749 -1.477336
H  1.875258 0.443426 2.087681
H  0.538555 -1.193036 -1.031645
H  2.454872 2.30169 -2.543189
H  4.161113 0.522421 1.041276
H  0.848903 -4.846636 1.063053
