program: Gaussian 09
title: 000185311
version: EM64L-G09RevD.01
frameworkgroup: C1[X(C15H14O6)]
method: RPBEPBE
basis: SDD
operation: Freq
keyword: #pfreq=noraman
keyword: PBEPBE/SDD
title: #p freq=noraman PBEPBE/SDD
converged: YES YES NO NO
title: Mulliken charges:
elementType: O O O O O O C C C C C C C C C C C C C C C H H H H H H H H H H H H H H
charge: -0.313444 -0.295831 -0.240364 -0.323312 -0.428463 -0.401362 0.334765 0.246512 0.064681 0.085587 0.163400 -0.599843 0.076369 -0.407750 0.005662 0.197655 0.167417 -0.365426 -0.513815 -0.511493 -0.516108 0.264322 0.243790 0.217888 0.374747 0.246157 0.234090 0.227975 0.354485 0.238612 0.226079 0.227685 0.218262 0.230245 0.270826
chargesum: 0.00000
title: Mulliken charges with hydrogens summed into heavy atoms:
elementType: O O O O O O C C C C C C C C C C C C C C C
charge: -0.313444 -0.295831 -0.240364 -0.323312 -0.053716 -0.046878 0.334765 0.246512 0.064681 0.085587 0.163400 -0.335521 0.076369 -0.163960 0.005662 0.197655 0.167417 -0.147538 0.194407 0.180883 0.203226
polarizability: 3.08810191e+02 -7.13231486e+00 2.12394111e+02 -1.82070579e+00 6.19219817e-01 8.87372318e+01
1716.lowfreq: -8.0290 -4.5470 -0.0003 0.0004 0.0005 2.9066 11.9944 30.3156 53.4650
frequency: 11.5774 30.1661 53.4451 69.2630 92.2873 100.8779 122.7757 133.9859 163.8757 172.8943 186.6590 191.2206 209.0136 211.3503 227.4165 273.5330 295.9675 297.1325 304.8140 324.1121 333.7048 340.4868 373.8663 391.9274 422.7715 471.7367 492.0559 500.5936 527.9320 564.4310 567.4174 570.8376 584.3590 609.8274 626.8455 669.3542 694.5663 734.4787 751.0779 765.7121 784.3139 786.1093 855.0117 866.2967 902.9746 905.4948 937.4991 954.3107 991.6376 1044.5352 1075.2770 1109.6819 1114.0685 1115.2491 1135.1361 1144.5591 1148.9606 1151.1559 1162.3874 1164.6811 1178.2997 1205.5951 1230.8748 1265.1711 1277.5947 1346.5303 1381.6033 1402.3883 1416.7293 1427.8843 1434.5128 1438.6217 1450.1693 1456.0410 1456.6338 1459.3380 1467.0429 1472.8921 1483.5042 1484.1107 1516.0482 1593.2535 1609.0690 1616.9846 1634.4016 2981.1227 2984.7369 2987.7941 3084.5150 3092.5448 3093.2196 3118.7617 3127.0534 3129.1492 3132.9386 3165.8035 3181.8634 3454.3023 3579.1108
redmass: 2.7734 2.5927 5.1328 3.8428 3.5260 4.8807 2.7969 2.4262 1.7132 1.5240 2.8176 1.9869 2.9575 2.2707 4.8731 5.0443 5.4794 5.9917 4.1349 1.6212 4.0503 3.0703 7.1140 5.6460 6.8948 7.8488 7.2080 6.5135 4.6140 1.3109 6.8151 4.5766 3.2219 5.9671 5.8329 5.5617 5.6677 7.0990 4.0626 7.7655 2.1595 3.4174 1.6462 7.7927 7.9493 1.3515 8.6842 5.8675 6.8219 5.0651 8.2590 1.2499 1.2425 1.2551 2.1276 1.5914 1.3482 1.5072 1.4767 1.4309 2.7162 2.6815 2.8726 1.9351 2.8939 6.1330 4.0809 4.1056 1.7451 2.2118 1.7477 1.1929 1.6653 1.0719 1.3720 1.0526 1.0610 1.0655 1.0604 3.6399 4.1316 8.3952 9.1046 7.7623 8.5593 1.0332 1.0304 1.0309 1.1042 1.1023 1.0999 1.0891 1.1030 1.1040 1.1055 1.0954 1.0931 1.0636 1.0660
irintensity: 2.7223 7.5485 5.9905 4.4838 2.5526 0.2936 1.0086 1.4313 2.9287 3.5773 1.3747 1.4027 1.4208 6.8787 3.4735 8.7428 3.4826 13.6892 9.9192 72.6758 14.6330 38.7258 2.1067 1.6296 3.4537 0.5745 8.2289 4.6081 1.4382 131.8985 26.7076 3.2365 10.5232 2.3420 8.2152 14.1292 1.1276 1.6591 2.3184 22.0313 41.4313 18.2471 25.5326 22.2557 3.1539 0.6260 7.4307 163.7723 329.9103 84.1936 112.1337 0.3355 12.3912 7.0549 41.1000 48.2634 40.2950 12.4121 8.3584 119.0016 25.4293 103.2448 180.5191 124.5469 39.4354 158.8092 58.6888 90.1517 119.9070 13.8056 16.5485 3.7312 49.5976 8.0579 66.8027 18.2705 19.0655 40.9744 23.3002 1.8205 75.2804 14.9248 129.4278 23.4259 37.7118 88.2937 59.0773 44.0530 39.7771 23.3315 38.5415 21.2039 30.5051 22.8541 15.7562 6.5320 1.2918 88.9284 63.8049
temp: 298.150 k
press: 1.00000 atm
elementType: 8 8 8 8 8 8 6 6 6 6 6 6 6 6 6 6 6 6 6 6 6 1 1 1 1 1 1 1 1 1 1 1 1 1 1
symmnumber: 1
zpe: 685663.0 jmol-1
zpe.correction: 0.261155 hartree
zpe.thermalcorrener: 0.281439 hartree
zpe.thermalcorrenthalpy: 0.282384 hartree
zpe.thermalcorrgfe: 0.211220 hartree
zpe.sumelectzpe: -1029.746967 hartree
zpe.sumelectthermal: -1029.726683 hartree
zpe.sumelectthermalent: -1029.725739 hartree
zpe.sumelectthermalfe: -1029.796903 hartree
dipole: -0.3699 1.6478 0.8697
dipole: 1.8996
quadrupole: -112.1936 -107.1610 -123.5598
quadrupole: -18.8565 -3.5128 -0.3881
quadrupole: 2.1112 7.1438 -9.2550 -18.8565 -3.5128 -0.3881
hfenergy: -1030.0081224 hartree
pointgroup: C01 [X(C15H14O6)]
dipole: -0.1366937 -0.6740082 -0.2925167 debye
polarizability: 308.3645952|7.120135|211.5362775|10.7980438|-9.4920057|90.0406613 unknown
InChI: InChI=1S/C15H14O6/c1-18-13-9(16)5-4-7-8-6-10(17)14(19-2)15(20-3)12(8)21-11(7)13/h4-6,16-17H,1-3H3
charge 0 multiplicity 1
35 atoms
O  0.54206 -1.050093 0.233165
O  -2.358739 -2.080624 0.268364
O  3.567528 -1.718244 0.357298
O  -4.371197 -0.039897 0.069814
O  -3.729207 2.541721 -0.183469
O  5.26323 0.335961 0.2500
C  -0.320917 1.130841 0.04827
C  1.137991 1.216461 0.072015
C  -0.639684 -0.250845 0.153061
C  1.623265 -0.120162 0.179987
C  -1.964273 -0.738413 0.170915
C  -1.345803 2.095554 -0.062632
C  2.992618 -0.45464 0.234607
C  2.053797 2.286957 0.026619
C  -2.984538 0.239173 0.023751
C  -2.672955 1.631531 -0.077412
C  3.896251 0.652458 0.19072
C  3.430228 1.98938 0.090746
C  -1.534842 -2.974342 1.10817
C  2.758486 -2.902762 0.024491
C  -4.886023 -1.031115 -0.906439
H  -1.144982 3.166104 -0.141925
H  1.712132 3.322614 -0.053104
H  4.165906 2.803379 0.056932
H  -4.574516 2.015299 -0.121687
H  -0.54849 -3.150525 0.64816
H  -2.106945 -3.912531 1.164848
H  -1.404834 -2.546002 2.118819
H  5.802846 1.164901 0.216861
H  3.474807 -3.737656 0.04079
H  2.306536 -2.806781 -0.979337
H  1.964116 -3.066678 0.773036
H  -4.67897 -0.69503 -1.94032
H  -5.971348 -1.072283 -0.72856
H  -4.422332 -2.013211 -0.724953
