program: Gaussian 09
title: 000185310
version: EM64L-G09RevD.01
frameworkgroup: C1[X(C15H14O6)]
method: RPBEPBE
basis: SDD
operation: Freq
keyword: #pfreq=noraman
keyword: PBEPBE/SDD
title: #p freq=noraman PBEPBE/SDD
converged: YES YES NO NO
title: Mulliken charges:
elementType: O O O O O O C C C C C C C C C C C C C C C H H H H H H H H H H H H H H
charge: -0.287643 -0.277908 -0.288429 -0.328893 -0.447331 -0.433212 0.247585 0.173200 0.078076 0.215875 -0.008402 0.106115 0.057312 0.033006 -0.353926 -0.506145 -0.400349 0.319988 -0.514215 -0.511972 -0.517021 0.273706 0.274102 0.216755 0.381295 0.214117 0.271189 0.224379 0.229902 0.222847 0.257215 0.219391 0.229284 0.275310 0.354795
chargesum: 0.00000
title: Mulliken charges with hydrogens summed into heavy atoms:
elementType: O O O O O O C C C C C C C C C C C C C C C
charge: -0.287643 -0.277908 -0.288429 -0.328893 -0.066036 -0.078418 0.247585 0.173200 0.078076 0.215875 -0.008402 0.106115 0.057312 0.033006 -0.080220 -0.232043 -0.183594 0.319988 0.195471 0.197993 0.206964
polarizability: 3.06389144e+02 3.13584343e+00 2.13940597e+02 5.26294076e-01 -8.68590358e-01 8.94758543e+01
1716.lowfreq: -0.0008 -0.0007 -0.0005 3.0306 5.2041 8.4051 42.8288 47.0025 54.8599
frequency: 42.8058 46.9927 54.8560 76.3607 96.0938 104.7966 115.2857 122.2179 149.9392 158.1556 168.7885 193.3977 204.0084 224.7172 250.8891 279.3876 291.3298 305.9744 316.1031 325.7238 345.0467 358.6306 369.8514 410.6055 433.6965 441.7517 451.9318 468.3928 498.8022 549.7764 571.3933 583.0494 608.4394 636.4211 651.5456 657.3932 731.3391 736.1261 765.3910 774.8417 801.5482 829.2112 850.0019 861.5946 883.8652 927.1610 931.5595 942.2324 1003.3836 1034.1505 1074.7422 1094.8546 1114.5407 1115.3494 1115.8912 1125.6971 1149.2442 1155.7275 1158.1750 1160.7601 1178.7848 1226.5816 1245.9602 1257.9660 1271.5332 1343.4118 1377.1401 1400.6584 1411.2117 1431.7708 1435.0455 1440.2318 1446.2054 1452.3093 1454.3186 1458.4154 1474.6041 1477.8318 1484.1484 1486.2731 1514.9445 1595.6753 1609.4980 1620.2980 1643.9703 2982.0943 2982.4797 2987.3211 3093.0648 3094.5321 3095.3591 3121.1771 3131.5757 3132.7940 3134.9855 3183.4286 3191.1481 3417.7391 3586.8658
redmass: 2.8649 2.2914 4.8447 2.9736 2.7193 2.9152 3.5827 2.3463 1.9548 1.9318 1.6513 2.7566 2.4671 5.8103 4.4723 6.7213 5.2348 7.1063 5.5783 5.7358 1.1138 6.5188 5.5820 6.7392 4.5336 3.6293 6.4692 6.9651 6.9878 8.1531 4.0632 1.3732 4.1852 6.2101 6.8266 7.2337 5.1655 7.2623 5.6892 5.4914 1.6003 7.2833 1.5197 7.8888 7.5979 9.0012 4.1363 1.3309 10.4098 7.2998 2.8391 4.6932 1.2430 1.2445 1.2512 1.6308 1.5312 1.4224 1.4577 1.4876 2.0600 2.5366 1.7707 4.7666 2.0264 5.1342 5.1975 3.9026 2.7668 1.3515 1.3516 1.5544 2.7172 1.0742 1.1012 1.0598 1.0581 1.0820 1.0548 3.1422 4.5857 8.2758 10.1071 8.3050 8.5016 1.0339 1.0335 1.0318 1.0976 1.1013 1.0991 1.0901 1.1047 1.1056 1.1057 1.0948 1.0938 1.0632 1.0660
irintensity: 3.2065 6.2849 6.9808 3.5812 0.9703 2.6652 1.1668 0.8965 0.3235 3.2306 2.8400 5.9005 3.4023 5.1552 0.8973 2.9557 2.5602 7.3687 5.5364 6.6670 144.7473 0.4971 7.5245 6.8323 2.5354 3.3524 2.1810 1.6818 17.7664 16.2437 32.3309 97.0634 8.3376 11.9791 2.2181 11.3967 1.5373 0.1986 10.0623 9.1469 36.9757 5.1864 38.1650 2.9509 25.9016 11.2658 110.9923 2.1080 290.1875 232.9929 126.5979 60.5064 15.2005 6.6682 3.9828 50.1683 23.5831 20.0756 8.5247 37.0883 5.7962 8.6297 358.0679 1.0254 49.8122 138.8452 177.2904 115.4095 51.7371 10.9371 14.4397 49.2050 9.5697 36.5258 2.7082 8.7646 45.7593 44.7832 24.3887 66.9390 90.8374 10.9193 34.4827 1.6358 96.4974 112.8889 62.2030 55.6449 36.4541 26.8179 35.0512 21.9820 20.7077 10.3230 13.6928 2.6966 0.8426 98.8061 64.4333
temp: 298.150 k
press: 1.00000 atm
elementType: 8 8 8 8 8 8 6 6 6 6 6 6 6 6 6 6 6 6 6 6 6 1 1 1 1 1 1 1 1 1 1 1 1 1 1
symmnumber: 1
zpe: 686508.7 jmol-1
zpe.correction: 0.261477 hartree
zpe.thermalcorrener: 0.281641 hartree
zpe.thermalcorrenthalpy: 0.282585 hartree
zpe.thermalcorrgfe: 0.213059 hartree
zpe.sumelectzpe: -1029.753802 hartree
zpe.sumelectthermal: -1029.733638 hartree
zpe.sumelectthermalent: -1029.732694 hartree
zpe.sumelectthermalfe: -1029.802220 hartree
dipole: -0.5342 0.3453 0.6598
dipole: 0.9165
quadrupole: -99.5810 -108.8994 -123.2993
quadrupole: 12.8757 3.3692 1.5045
quadrupole: 11.0123 1.6938 -12.7060 12.8757 3.3692 1.5045
hfenergy: -1030.0152791 hartree
pointgroup: C01 [X(C15H14O6)]
dipole: -0.1983989 0.1094608 0.2804809 debye
polarizability: 306.4189299|-1.3007975|211.784396|-3.3406737|15.9792643|91.6022693 unknown
InChI: InChI=1S/C15H14O6/c1-18-12-10-8-5-4-7(16)6-9(8)21-13(10)15(20-3)14(19-2)11(12)17/h4-6,16-17H,1-3H3
charge 0 multiplicity 1
35 atoms
O  0.756809 -1.756131 -0.406372
O  -0.114144 2.873066 0.147997
O  -2.252054 -2.41688 -0.339268
O  -3.9672 -0.130705 0.004583
O  -3.037175 2.334055 0.163334
O  5.59026 -1.063563 -0.537789
C  0.190188 0.502745 -0.096368
C  1.642409 0.402978 -0.175721
C  -0.310758 -0.820415 -0.241392
C  1.942735 -0.978776 -0.360115
C  -0.692046 1.597561 0.071639
C  -1.682798 -1.14168 -0.205011
C  -2.556017 -0.029251 -0.078465
C  -2.080155 1.310559 0.059871
C  2.712551 1.323874 -0.118961
C  3.23476 -1.494889 -0.482869
C  4.033374 0.840605 -0.237224
C  4.285498 -0.549802 -0.415591
C  -0.72632 3.864357 1.060698
C  -1.512944 -3.551442 0.255996
C  -4.647776 -0.831465 -1.113597
H  2.510542 2.389885 0.008421
H  3.445294 -2.556343 -0.626079
H  4.875467 1.543415 -0.19565
H  -3.92575 1.876221 0.180784
H  -0.731758 3.478709 2.097939
H  -1.753863 4.106661 0.749371
H  -0.073408 4.747672 0.989861
H  -2.187043 -4.414047 0.145299
H  -1.310812 -3.360726 1.326181
H  -0.564377 -3.728342 -0.276289
H  -4.431879 -0.323139 -2.072467
H  -5.721495 -0.769243 -0.880135
H  -4.314484 -1.879871 -1.153982
H  6.257764 -0.335556 -0.486525
