program: Gaussian 09
title: 000185295
version: EM64L-G09RevD.01
frameworkgroup: C1[X(C20H25N3O3)]
method: RPBEPBE
basis: SDD
operation: Freq
keyword: #p
keyword: freq=noraman
keyword: PBEPBE/SDD
title: #p freq=noraman PBEPBE/SDD
converged: YES YES NO NO
title: Mulliken charges:
elementType: O O O N N N C C C C C C C C C C C C C C C C C C C C H H H H H H H H H H H H H H H H H H H H H H H H H
charge: -0.290465 -0.244558 -0.188540 -0.406571 -0.402468 -0.212874 0.151490 0.225797 0.225554 -0.410370 -0.706509 -0.738132 -0.722989 -0.691001 0.123788 -0.405818 -0.372650 -0.386287 0.100593 0.085083 0.191363 0.184837 -0.354146 -0.351156 -0.208724 -0.208282 0.253021 0.260795 0.222184 0.236454 0.203573 0.268835 0.210203 0.202523 0.228987 0.212498 0.214243 0.212514 0.190685 0.237167 0.373797 0.263182 0.218377 0.243530 0.232407 0.253292 0.246935 0.271871 0.271888 0.242055 0.242016
chargesum: 0.00000
title: Mulliken charges with hydrogens summed into heavy atoms:
elementType: O O O N N N C C C C C C C C C C C C C C C C C C C C
charge: -0.290465 -0.244558 -0.188540 -0.153550 -0.028670 -0.212874 0.151490 0.225797 0.225554 -0.149575 -0.044298 -0.056571 -0.067260 -0.050635 0.123788 0.075741 0.103287 0.113941 0.100593 0.085083 0.191363 0.184837 -0.082275 -0.079268 0.033332 0.033734
polarizability: 3.19049592e+02 1.00098435e+01 2.63033882e+02 -9.16968461e+00 -1.38844737e+01 1.70654627e+02
1716.lowfreq: -12.8431 -0.0005 -0.0003 0.0006 2.0136 5.1426 12.9267 20.6983 23.8119
frequency: 12.8171 20.6336 23.7516 39.1047 44.2393 65.5093 68.8112 94.8390 112.5725 137.2053 141.6317 166.9257 177.7262 192.3997 198.4274 223.5978 227.4703 240.3085 244.4796 254.2229 274.6595 291.1908 297.0149 297.9831 300.5284 329.1168 332.9021 338.7186 378.2688 389.4861 405.3030 413.4778 431.0821 455.6048 466.2506 513.5463 523.8656 530.8551 555.1567 574.8491 593.5754 595.7381 658.6392 671.5377 676.1296 685.5269 692.8482 712.6428 738.5642 742.8090 782.5681 785.2618 797.7115 838.7248 847.9103 853.2457 872.4429 894.7131 904.1764 907.3160 912.4355 920.7335 933.1071 939.3954 947.5869 975.3894 985.0816 994.2553 998.7302 1003.0562 1007.5975 1013.1951 1046.6438 1065.7564 1073.8995 1105.6843 1128.9711 1138.8368 1154.4724 1168.5991 1171.5796 1175.6963 1197.0670 1198.8685 1216.4016 1218.3302 1263.7770 1269.1531 1281.0101 1284.8623 1311.3004 1321.0632 1334.4012 1349.3527 1358.4982 1362.6531 1363.1117 1370.6519 1371.7052 1380.8000 1404.1808 1417.4945 1448.1220 1450.6736 1452.5881 1453.5810 1454.4852 1457.3698 1458.0270 1458.4296 1467.2380 1471.8662 1475.7587 1479.0423 1492.5338 1507.4023 1565.8852 1614.2391 1615.7657 1621.4449 1637.6278 1673.6172 2967.1330 2971.4918 2975.3573 2983.8146 2999.2025 3004.1879 3020.3381 3060.5399 3061.3223 3064.9827 3070.9661 3076.3203 3080.6504 3082.1448 3085.7449 3097.9371 3099.3845 3103.0885 3136.0105 3142.1011 3155.0908 3166.2950 3176.3618 3475.5862 3477.8153
redmass: 3.6831 5.9155 5.4033 5.5332 6.0226 3.1762 4.4286 3.9561 4.8966 4.1969 4.3413 4.6224 5.9062 2.2344 1.1993 2.6567 1.1550 1.4401 4.5309 1.9807 1.3058 2.3112 2.1352 2.6252 2.5975 5.6538 2.7179 3.4680 2.7002 2.5642 3.0766 3.2447 2.3903 4.8511 2.8202 2.9783 6.8683 3.3771 3.5087 4.0266 5.2055 2.9218 4.7680 2.1820 2.2997 3.8128 3.5530 2.8356 2.9939 3.0814 3.3310 3.5414 1.8492 4.0329 3.7796 3.8852 1.6576 1.7927 1.5618 1.3899 2.0447 2.0075 2.0448 3.1376 2.1350 1.4130 1.3458 1.9387 1.7657 1.7303 1.3513 2.1147 2.2089 2.1935 2.6213 3.0217 3.0050 2.3429 2.9628 1.2392 2.0194 2.0578 3.2328 2.1932 1.9614 1.8667 1.6693 2.2372 1.8039 1.5048 1.4569 2.6766 2.4240 1.4246 1.2073 1.4241 1.2746 1.2827 1.3414 1.2064 1.3854 5.7778 1.3043 1.2125 1.0517 2.4448 1.0557 1.4091 1.3086 1.0764 1.0539 1.0610 1.0582 1.0775 1.0792 1.7791 5.6568 9.0456 7.7436 8.4896 8.0269 11.5013 1.0349 1.0359 1.0357 1.0348 1.0600 1.0632 1.0599 1.0994 1.0996 1.0992 1.0989 1.1027 1.1004 1.0989 1.1050 1.1003 1.0996 1.0997 1.0962 1.0866 1.0907 1.0957 1.1005 1.0760 1.0793
irintensity: 0.2161 0.2561 0.4316 0.6108 2.8027 0.2155 3.1270 0.8573 7.0441 3.4413 0.3682 4.1767 1.1397 0.8154 0.5389 0.0603 0.6440 0.6050 1.4025 0.5923 0.0914 0.4984 0.8444 10.6444 3.4724 30.0745 3.8783 7.3535 6.1725 1.1947 12.6981 2.7467 35.4350 0.2234 3.2500 1.0494 17.5603 40.1593 7.0397 4.2066 4.4472 11.2181 0.2972 60.8457 36.2787 13.5576 24.6217 67.1352 8.1774 20.2557 25.9412 21.6224 19.6860 25.1210 4.3116 7.0937 21.2370 18.5328 0.3548 0.0435 5.1400 4.3847 25.3905 2.0222 1.0320 1.9084 1.4193 14.0120 22.8061 15.8341 0.0391 3.7710 4.0090 34.7386 4.6950 4.1975 17.7350 8.9311 28.8300 13.2005 10.2401 15.6607 42.1293 28.5713 9.9553 28.6891 11.9245 36.2341 53.0278 2.0234 142.7741 61.3512 200.9948 29.0205 7.3946 44.0641 20.0453 87.2848 3.3746 7.3333 5.9922 8.9609 23.8144 68.3207 0.4990 13.2797 0.9340 12.5538 8.5511 5.8243 6.4313 12.2564 1.5116 7.3714 50.3009 481.4064 114.3941 295.4730 17.3187 126.7815 33.9361 77.3415 22.6936 43.8724 43.7964 31.4811 18.7686 42.8658 11.4842 6.6560 22.9954 34.1746 64.7574 17.0407 33.8219 40.9670 8.0717 6.5731 35.8863 18.8744 7.4784 1.4769 4.5800 4.7295 19.7458 0.7785 168.5173
temp: 298.150 k
press: 1.00000 atm
elementType: 8 8 8 7 7 7 6 6 6 6 6 6 6 6 6 6 6 6 6 6 6 6 6 6 6 6 1 1 1 1 1 1 1 1 1 1 1 1 1 1 1 1 1 1 1 1 1 1 1 1 1
symmnumber: 1
zpe: 1094365.1 jmol-1
zpe.correction: 0.416822 hartree
zpe.thermalcorrener: 0.442577 hartree
zpe.thermalcorrenthalpy: 0.443521 hartree
zpe.thermalcorrgfe: 0.359296 hartree
zpe.sumelectzpe: -1165.170022 hartree
zpe.sumelectthermal: -1165.144267 hartree
zpe.sumelectthermalent: -1165.143322 hartree
zpe.sumelectthermalfe: -1165.227547 hartree
dipole: 5.2676 4.1590 0.8011
dipole: 6.7592
quadrupole: -134.3552 -160.0828 -155.7621
quadrupole: 8.0833 -17.6701 -1.0641
quadrupole: 15.7115 -10.0161 -5.6954 8.0833 -17.6701 -1.0641
hfenergy: -1165.5868434 hartree
pointgroup: C01 [X(C20H25N3O3)]
dipole: 2.0915899 -1.5675532 -0.4896041 debye
polarizability: 319.6830786|-9.8713821|264.3239638|5.5124034|-5.7586504|168.731059 unknown
InChI: InChI=1S/C20H25N3O3/c1-19(2)12-15(20(3,4)22-19)16(24)21-10-7-11-23-17(25)13-8-5-6-9-14(13)18(23)26/h5-6,8-9,12,21-22H,7,10-11H2,1-4H3
charge 0 multiplicity 1
51 atoms
O  -2.734558 2.409797 1.055225
O  1.042553 -1.042691 -0.080566
O  4.08419 2.391928 -1.150257
N  -5.131178 -1.16969 0.060581
N  -0.945544 0.93892 0.843303
N  2.294116 0.887521 -0.700745
C  -4.717217 0.205025 0.511369
C  -4.029402 -1.890577 -0.652646
C  -3.195043 0.135983 0.318929
C  -2.833713 -1.00757 -0.3262
C  -5.108305 0.423312 1.995798
C  -5.345904 1.327385 -0.36754
C  -4.257687 -1.967626 -2.194754
C  -3.851508 -3.323978 -0.080989
C  -2.293305 1.245913 0.761931
C  0.062218 1.947927 1.192066
C  0.638546 2.690317 -0.040703
C  1.186062 1.756667 -1.14459
C  2.142926 -0.440056 -0.224812
C  3.672504 1.276816 -0.750895
C  3.525867 -0.941262 0.052576
C  4.444983 0.091306 -0.257903
C  3.956305 -2.185595 0.535395
C  5.826466 -0.086272 -0.095971
C  5.353478 -2.375609 0.702634
C  6.273512 -1.342622 0.392276
H  -6.036811 -1.192401 -0.42247
H  -1.819903 -1.302494 -0.620105
H  -4.670197 -0.371267 2.623722
H  -4.758977 1.408264 2.351335
H  -6.207733 0.373875 2.10218
H  -4.97831 2.313889 -0.040009
H  -5.084054 1.187933 -1.432557
H  -6.448936 1.308392 -0.270474
H  -4.370928 -0.956597 -2.624669
H  -3.413314 -2.470293 -2.702117
H  -5.17424 -2.548783 -2.414077
H  -4.759919 -3.923056 -0.276651
H  -2.987577 -3.841105 -0.540902
H  -3.703813 -3.274425 1.010519
H  -0.605858 0.002203 0.600545
H  -0.415597 2.687404 1.858066
H  0.873003 1.449618 1.755508
H  -0.165129 3.301903 -0.49221
H  1.434269 3.384116 0.290762
H  0.381985 1.09624 -1.514839
H  1.566538 2.360346 -1.987216
H  3.237408 -2.976156 0.77143
H  6.528179 0.71745 -0.339318
H  5.728465 -3.333967 1.077037
H  7.34529 -1.518858 0.531903
