program: Gaussian 09
title: 000185260
version: EM64L-G09RevD.01
frameworkgroup: C1[X(C17H22N2)]
method: RPBEPBE
basis: SDD
operation: Freq
keyword: #pfreq=noraman
keyword: PBEPBE/SDD
title: #p freq=noraman PBEPBE/SDD
converged: YES YES NO NO
title: Mulliken charges:
elementType: N N C C C C C C C C C C C C C C C C C H H H H H H H H H H H H H H H H H H H H H H
charge: -0.069085 -0.212579 -0.346115 -0.366851 -0.398410 -0.388553 -0.398675 -0.347857 -0.583921 0.514014 -0.416163 -0.418062 0.474505 -0.381858 -0.382072 -0.200960 -0.201938 -0.309456 -0.308952 0.206237 0.168251 0.167241 0.211369 0.205621 0.191009 0.191684 0.203990 0.188984 0.213842 0.191311 0.221029 0.213349 0.223243 0.235151 0.237532 0.242924 0.243593 0.251903 0.251813 0.241457 0.241454
chargesum: 0.00000
title: Mulliken charges with hydrogens summed into heavy atoms:
elementType: N N C C C C C C C C C C C C C C C C C
charge: -0.069085 -0.212579 0.028373 0.011759 -0.001780 0.007121 0.004151 0.064484 -0.147329 0.514014 -0.181013 -0.180530 0.474505 -0.138934 -0.138479 0.050943 0.049874 -0.068000 -0.067497
polarizability: 3.07499785e+02 7.63755353e+00 1.72281820e+02 -1.73387092e+01 1.21440853e+01 1.25467309e+02
1716.lowfreq: -20.5146 -5.1073 -0.0006 0.0006 0.0011 4.2970 11.7090 20.5498 28.3739
frequency: -14.1780 20.3947 28.3135 60.4333 67.4368 92.0597 118.0483 133.9766 185.2795 213.7102 231.9576 293.8395 303.8628 337.9820 362.3091 382.3558 410.1615 410.8632 441.6605 448.6165 454.1022 533.0724 561.6077 606.4242 619.9346 639.5031 644.4069 692.4446 724.8891 729.8544 757.9896 786.8884 803.6080 815.8165 828.5893 834.5699 842.5661 852.9251 858.9030 862.5323 877.1729 904.4283 913.7943 950.5185 958.5819 966.8551 991.2266 1006.4556 1017.3285 1020.5189 1031.2758 1049.5500 1068.8943 1077.4640 1082.7985 1105.0058 1114.7769 1120.2821 1123.9126 1150.3093 1156.5922 1173.0904 1192.1191 1220.3712 1232.6340 1254.0327 1259.0860 1265.5522 1285.3327 1286.2255 1290.0964 1300.9279 1323.4723 1327.7686 1329.8727 1338.5376 1341.7069 1348.9949 1365.6316 1380.5645 1389.6943 1405.4284 1421.4278 1451.4986 1459.9811 1460.5102 1465.8992 1471.9080 1473.4781 1477.7859 1487.6408 1516.9280 1519.0189 1586.1147 1626.3946 2814.2869 2823.7107 2848.2119 2966.3829 2984.8079 2986.1508 2996.1856 3015.2265 3023.2552 3031.5978 3037.3569 3045.6011 3054.7547 3060.9181 3122.8777 3125.0913 3153.8038 3158.1920 3205.5405 3218.7289 3237.0370 3249.3016
redmass: 3.4194 3.5802 4.8235 3.2104 3.5144 3.9474 4.3638 3.5611 2.8625 3.6108 1.8859 2.2098 3.1289 3.1235 4.5879 1.9822 2.9559 3.4435 3.4354 2.9337 3.3461 2.2072 2.1537 2.8917 3.7125 5.2970 4.2638 1.3128 1.3358 2.9958 3.8935 1.2249 1.5525 2.2060 1.4126 1.2622 2.2087 1.4181 2.5474 5.4608 1.3399 2.3507 3.8195 1.3810 1.2981 1.3647 2.5654 3.0313 1.6481 1.7181 3.2541 2.1298 1.2813 1.5074 1.8131 2.0968 1.9146 2.2992 1.4920 1.2652 2.4883 1.2378 1.1039 2.1816 1.7700 1.4205 1.2611 1.1777 1.2184 1.5053 2.0496 1.4616 1.5563 3.2371 1.3190 1.3913 1.4584 1.4609 1.4166 5.9301 1.3909 4.2586 3.2086 1.0900 1.0851 1.0877 1.0914 1.2211 2.4561 1.1190 1.0965 3.0996 4.5136 7.0231 6.5009 1.0714 1.0701 1.0698 1.0627 1.0616 1.0612 1.0611 1.0867 1.0871 1.0934 1.0892 1.1033 1.1035 1.1025 1.0888 1.0887 1.0949 1.0959 1.0887 1.0939 1.1008 1.1108
irintensity: 0.1471 0.0168 0.0291 0.1521 1.5655 0.0692 0.1828 0.1070 1.2662 0.6212 0.6914 1.5183 0.7805 1.5220 2.5026 2.7704 0.8969 3.8585 2.8873 1.1199 1.3407 19.5016 9.7945 2.4957 7.7974 3.6794 1.9979 1.2814 157.5424 10.7274 3.9279 0.9735 1.2552 18.1607 0.8461 1.7789 23.5588 6.1138 29.8979 1.0719 0.0657 3.4880 22.7041 0.2513 3.2309 1.0222 16.1644 0.6268 4.3926 23.0890 22.8860 6.7754 23.1428 26.8293 26.4929 46.2338 24.4849 7.7299 16.2764 6.9148 39.5550 4.2239 3.2641 1.0492 8.5338 3.6136 4.9566 7.2145 2.6104 1.9892 2.8311 16.6736 1.4738 103.2586 5.1791 2.2807 10.6923 1.8937 6.8112 0.9065 0.9485 8.4518 1.8938 7.1743 3.5963 14.6033 12.5141 15.3474 52.3336 2.0881 14.0784 263.8597 0.0698 1.3509 26.6485 48.5482 94.1602 150.0036 39.3781 35.1006 40.2857 22.0344 5.1107 79.1198 83.6114 22.9304 17.7418 97.2581 29.6113 9.4905 29.3955 15.6485 3.0462 4.2672 4.0968 2.2027 2.4573
temp: 298.150 k
press: 1.00000 atm
elementType: 7 7 6 6 6 6 6 6 6 6 6 6 6 6 6 6 6 6 6 1 1 1 1 1 1 1 1 1 1 1 1 1 1 1 1 1 1 1 1 1 1
symmnumber: 1
zpe: 924536.2 jmol-1
zpe.correction: 0.352137 hartree
zpe.thermalcorrener: 0.368438 hartree
zpe.thermalcorrenthalpy: 0.369382 hartree
zpe.thermalcorrgfe: 0.306575 hartree
zpe.sumelectzpe: -769.082165 hartree
zpe.sumelectthermal: -769.065864 hartree
zpe.sumelectthermalent: -769.064920 hartree
zpe.sumelectthermalfe: -769.127728 hartree
dipole: -2.2744 -0.2658 -0.4579
dipole: 2.3352
quadrupole: -118.1787 -106.1337 -119.1147
quadrupole: 0.8622 1.6081 3.1820
quadrupole: -3.7030 8.3420 -4.6390 0.8622 1.6081 3.1820
hfenergy: -769.4343021 hartree
pointgroup: C01 [X(C17H22N2)]
dipole: 0.8941313 0.1414393 -0.1568407 debye
polarizability: 307.4289168|4.9790244|175.1608673|18.5781237|-2.556125|122.6591301 unknown
InChI: InChI=1S/C17H22N2/c1-2-11-18(12-3-1)15-10-16-6-8-17(9-7-16)19-13-4-5-14-19/h4-9,13-14H,1-3,10-12,15H2
charge 0 multiplicity 1
41 atoms
N  3.766075 -0.201172 -0.004229
N  -4.204465 -0.046177 -0.125684
C  4.403715 1.135048 0.119159
C  4.47416 -1.039071 -1.007833
C  5.88285 1.010578 0.53986
C  5.952828 -1.240244 -0.619125
C  6.664934 0.122033 -0.453887
C  2.310525 -0.125985 -0.269858
C  1.49012 0.316402 0.974251
C  -0.005599 0.236611 0.716755
C  -0.709133 1.31643 0.12409
C  -0.73717 -0.940596 1.018875
C  -2.803207 0.047535 0.152262
C  -2.086091 1.227984 -0.165013
C  -2.117968 -1.037918 0.753245
C  -4.901605 -1.226475 -0.437288
C  -5.114316 1.02553 -0.133032
C  -6.243908 -0.900065 -0.643752
C  -6.379662 0.522588 -0.444662
H  3.853661 1.72702 0.872541
H  4.342246 1.695015 -0.853556
H  4.42634 -0.575606 -2.030069
H  3.960817 -2.017284 -1.066356
H  5.926298 0.562042 1.551076
H  6.333778 2.020085 0.599867
H  6.456137 -1.85381 -1.391217
H  5.995738 -1.798675 0.335947
H  6.718461 0.630965 -1.438938
H  7.70626 -0.022901 -0.108875
H  2.072549 0.55668 -1.126977
H  1.967553 -1.136126 -0.565271
H  1.766802 1.349885 1.255047
H  1.781306 -0.339936 1.814722
H  -0.169426 2.238825 -0.122865
H  -0.221699 -1.786233 1.490269
H  -2.598144 2.061437 -0.656877
H  -2.669209 -1.939186 1.04042
H  -4.382609 -2.176729 -0.538198
H  -4.800967 2.031814 0.134752
H  -7.03214 -1.600165 -0.916534
H  -7.295931 1.107446 -0.51014
