program: Gaussian 09
title: 000185252
version: EM64L-G09RevD.01
frameworkgroup: C1[X(C16H25NOS)]
method: RPBEPBE
basis: SDD
operation: Freq
keyword: #p
keyword: freq=noraman
keyword: PBEPBE/SDD
title: #p freq=noraman PBEPBE/SDD
converged: YES YES NO NO
title: Mulliken charges:
elementType: S O N C C C C C C C C C C C C C C C C H H H H H H H H H H H H H H H H H H H H H H H H H
charge: 0.099266 -0.245624 -0.081368 -0.346215 -0.358215 -0.395036 -0.428322 -0.567053 0.503948 -0.627302 -0.024461 -0.413899 -0.414698 -0.228773 -0.229116 -0.627967 -0.306047 -0.244134 -0.675497 0.187018 0.202048 0.200415 0.223779 0.217473 0.211231 0.215698 0.263018 0.208154 0.205252 0.227114 0.254351 0.244529 0.231817 0.229798 0.287666 0.244544 0.223051 0.222331 0.235166 0.206045 0.226773 0.218991 0.205641 0.218609
chargesum: 0.00000
title: Mulliken charges with hydrogens summed into heavy atoms:
elementType: S O N C C C C C C C C C C C C C C C C
charge: 0.099266 -0.245624 -0.081368 0.042851 0.065979 0.033669 0.050394 -0.153647 0.503948 0.098692 -0.024461 -0.182082 -0.184900 -0.005722 -0.006785 -0.095757 0.135163 -0.017361 -0.032255
polarizability: 2.65011897e+02 -1.82275611e+01 1.92917445e+02 -1.15662279e+01 6.67100649e-01 1.49632744e+02
1716.lowfreq: -4.9781 -0.0018 -0.0007 -0.0007 4.0038 7.1534 12.7492 16.0636 25.0092
frequency: 12.5629 15.9974 24.9947 32.1521 40.3980 44.9050 60.3651 70.3452 76.4404 101.9073 110.6521 123.5445 127.6047 148.0518 208.2031 220.1882 227.0546 233.9397 258.5240 292.5316 323.9456 334.9649 373.0822 391.7130 403.1721 406.8976 431.7603 511.2380 528.1705 586.1602 618.0731 619.0393 658.2280 685.1707 705.1824 728.1616 733.4442 755.4942 759.5353 809.4862 823.5045 845.3145 852.8166 889.4787 897.1685 916.0678 945.2658 975.0255 989.7749 992.2870 999.1464 1026.1570 1035.7515 1042.4162 1051.8025 1065.9779 1067.2910 1073.6215 1079.1774 1102.2653 1107.6664 1109.9475 1135.6412 1171.4690 1186.0834 1214.0980 1216.1148 1226.3073 1226.9762 1246.2188 1254.3187 1273.4726 1286.4445 1288.8751 1291.4070 1293.0029 1326.9191 1327.4363 1329.2268 1349.9030 1356.7101 1374.1771 1382.4952 1387.0499 1423.4126 1440.2293 1443.9801 1455.6468 1464.4744 1466.2622 1470.7101 1472.0227 1477.1002 1478.1036 1483.7493 1483.9970 1487.3463 1488.4994 1593.0088 1614.5346 1621.5892 2952.5341 2968.8065 2972.5140 2975.0872 2976.0031 2979.2265 2983.1330 2996.7036 2997.2758 3017.3490 3022.4973 3037.2466 3046.4079 3050.4232 3059.6969 3074.5201 3077.7572 3080.9402 3091.6421 3103.9775 3112.4611 3113.8463 3130.1805 3141.9348 3160.9867
redmass: 4.2824 3.7022 3.7029 4.3824 3.9682 2.7800 2.9854 5.0601 1.7970 1.3850 1.7993 3.2182 2.3705 4.1219 2.5330 3.0577 1.2618 3.4290 2.6755 4.2422 3.9445 2.3340 4.7480 2.6277 2.8161 4.0101 7.7506 3.4236 3.9136 4.3785 6.3554 10.3665 5.1531 4.9725 1.7360 1.1144 1.0691 1.1488 1.9550 3.8047 1.3244 1.2296 1.2493 3.5626 1.9539 1.4854 1.3994 1.3878 6.2402 1.4404 3.5366 2.3140 3.1205 2.8830 1.5221 1.6355 4.0199 2.5432 1.3088 1.5255 2.0734 1.3173 1.5302 1.0520 1.1140 1.8980 2.3679 1.3185 1.3552 2.1075 1.2073 1.3883 1.3089 1.1493 1.2041 1.1057 1.2522 1.4060 1.4013 1.5559 1.7027 1.5402 7.8437 1.2048 1.1051 2.1815 1.1633 1.0882 1.0686 1.0979 1.0629 1.0522 1.0431 1.1095 2.2516 1.0679 1.0951 1.0848 6.0434 6.1995 8.2599 1.0593 1.0588 1.0448 1.0355 1.0525 1.0594 1.0671 1.0958 1.0609 1.1009 1.0579 1.1016 1.1000 1.1039 1.0984 1.1007 1.1000 1.0993 1.1008 1.1069 1.0870 1.0869 1.0906 1.0958 1.1015
irintensity: 0.0856 0.0286 0.1046 0.0843 1.3878 2.0137 1.7450 1.6385 0.1881 0.5922 0.3889 0.5263 0.2558 0.4549 2.0684 2.0523 0.8239 1.3925 2.2091 3.6309 19.2092 0.1228 2.2135 9.6667 0.0088 8.7711 1.0729 5.8391 12.7644 3.5802 0.0608 8.0717 35.1282 16.4643 52.1755 7.7169 9.3785 1.1747 47.4432 4.6598 1.2762 2.8892 0.0096 23.7898 15.7239 0.7032 4.5886 0.0393 0.0500 0.1556 3.7245 8.3946 5.5622 4.6967 5.0669 163.0651 10.2791 1.1578 11.3475 65.3388 3.6952 0.5622 56.4262 0.0638 0.2645 3.0452 0.6184 2.1425 5.6532 77.6816 3.9129 65.5530 1.3066 11.6257 25.1147 2.8857 0.0962 7.0536 5.4069 6.0702 19.1084 39.3524 0.0995 10.1825 18.3136 6.3722 15.4170 9.5327 1.4506 4.1185 1.7147 21.4016 12.3922 3.3084 21.7713 13.5576 13.3470 55.9763 1.4766 13.7920 246.0177 17.6909 0.1537 13.9369 45.4400 15.0562 67.4998 82.8184 10.2759 16.0599 0.3598 27.7740 3.3854 0.7637 90.3120 23.3626 45.4336 47.8824 17.3424 23.3866 15.4717 9.7138 9.0690 10.8336 47.4767 25.0668
temp: 298.150 k
press: 1.00000 atm
elementType: 16 8 7 6 6 6 6 6 6 6 6 6 6 6 6 6 6 6 6 1 1 1 1 1 1 1 1 1 1 1 1 1 1 1 1 1 1 1 1 1 1 1 1 1
symmnumber: 1
zpe: 988793.5 jmol-1
zpe.correction: 0.376612 hartree
zpe.thermalcorrener: 0.398856 hartree
zpe.thermalcorrenthalpy: 0.399800 hartree
zpe.thermalcorrgfe: 0.319445 hartree
zpe.sumelectzpe: -1151.277887 hartree
zpe.sumelectthermal: -1151.255643 hartree
zpe.sumelectthermalent: -1151.254698 hartree
zpe.sumelectthermalfe: -1151.335054 hartree
dipole: 0.8824 -2.1422 0.0858
dipole: 2.3184
quadrupole: -125.0189 -115.0109 -126.2309
quadrupole: -0.4749 -1.9426 -3.0558
quadrupole: -2.9320 7.0760 -4.1440 -0.4749 -1.9426 -3.0558
hfenergy: -1151.6544987 hartree
pointgroup: C01 [X(C16H25N1O1S1)]
dipole: -0.338097 -0.7834448 0.3223417 debye
polarizability: 265.5949265|14.5161707|184.9390932|-13.2202147|-17.3119054|157.0280665 unknown
InChI: InChI=1S/C16H25NOS/c1-3-14-19-16(18)17(2)13-9-5-8-12-15-10-6-4-7-11-15/h4,6-7,10-11H,3,5,8-9,12-14H2,1-2H3
charge 0 multiplicity 1
44 atoms
S  5.087294 0.071891 1.655648
O  3.658014 0.665269 -0.637994
N  2.857858 -1.155937 0.594762
C  -0.805046 -0.966747 -0.710228
C  0.377638 -0.76864 0.264244
C  -2.138588 -0.419691 -0.155013
C  1.697483 -1.328804 -0.314354
C  -3.324047 -0.612445 -1.141856
C  -4.6345 -0.068604 -0.592001
C  2.935877 -2.01435 1.788983
C  3.730549 -0.114347 0.352116
C  -5.011224 1.281636 -0.813583
C  -5.489221 -0.885181 0.193486
C  -6.204885 1.803366 -0.265569
C  -6.684196 -0.369238 0.744156
C  6.062377 1.441732 0.784991
C  7.092483 0.89552 -0.21687
C  -7.046343 0.978937 0.517064
C  7.883322 2.041206 -0.890015
H  -0.920568 -2.047125 -0.94113
H  -0.575306 -0.464536 -1.672893
H  0.146281 -1.263467 1.229252
H  0.510643 0.309778 0.476886
H  -2.032146 0.658975 0.076582
H  -2.380635 -0.921744 0.803455
H  1.588521 -2.410386 -0.531452
H  1.940908 -0.810662 -1.257263
H  -3.073045 -0.108368 -2.095984
H  -3.424321 -1.692976 -1.366419
H  2.415682 -2.963905 1.576211
H  3.9875 -2.244812 2.03138
H  2.467093 -1.546136 2.675678
H  -4.366113 1.925798 -1.424718
H  -5.21805 -1.934216 0.368935
H  5.309245 2.067368 0.276158
H  6.534369 2.014708 1.602138
H  -6.48075 2.847782 -0.451602
H  -7.333723 -1.016843 1.344464
H  6.559919 0.305817 -0.985562
H  7.788635 0.206821 0.298904
H  -7.97409 1.380237 0.940318
H  8.612739 1.640533 -1.617198
H  8.442234 2.637609 -0.144121
H  7.20493 2.72518 -1.433084
