program: Gaussian 09
title: 000185251
version: EM64L-G09RevD.01
frameworkgroup: C1[X(C14H26Cl2O2)]
method: RPBEPBE
basis: SDD
operation: Freq
keyword: #p
keyword: freq=noraman
keyword: PBEPBE/SDD
title: #p freq=noraman PBEPBE/SDD
converged: YES YES NO NO
title: Mulliken charges:
elementType: Cl Cl O O C C C C C C C C C C C C C C H H H H H H H H H H H H H H H H H H H H H H H H H H
charge: 0.045020 0.058136 -0.404993 -0.177246 -0.386154 -0.387080 -0.384814 -0.391095 -0.382056 -0.378956 -0.372708 -0.372006 -0.353391 -0.287304 -0.356576 -0.520427 -0.696439 0.289559 0.194483 0.194961 0.195340 0.195303 0.193443 0.193356 0.196705 0.199499 0.192271 0.192266 0.199111 0.199617 0.189361 0.189490 0.212377 0.219593 0.187716 0.187782 0.251106 0.257474 0.194796 0.194688 0.209608 0.209763 0.215194 0.393228
chargesum: 0.00000
title: Mulliken charges with hydrogens summed into heavy atoms:
elementType: Cl Cl O O C C C C C C C C C C C C C C
charge: 0.045020 0.058136 -0.011765 -0.177246 0.003290 0.003563 0.001985 0.005109 0.002481 0.019771 0.006144 0.059965 0.022106 0.221275 0.032908 -0.520427 -0.061875 0.289559
polarizability: 2.28712793e+02 4.08929469e+00 1.50353699e+02 3.06299124e+00 1.62928836e+00 1.62179749e+02
1716.lowfreq: -28.2223 -7.2557 0.0013 0.0021 0.0022 2.9097 6.5040 7.0703 21.3372
frequency: -24.2823 4.9879 21.3141 30.1922 43.3653 46.7094 59.9189 65.0164 87.0915 97.6474 106.7031 121.6883 123.3340 133.7544 146.0785 151.4478 168.0790 183.1180 216.8505 226.7507 241.8958 262.6262 299.7662 317.5307 340.7353 386.0111 394.8937 423.0629 482.0713 490.0538 536.5132 565.8829 619.6020 652.5774 716.9771 719.0937 724.4388 734.5622 748.9933 759.9386 781.4898 814.4245 850.6018 887.2691 892.7342 939.9070 979.6593 985.3656 986.0862 1012.9739 1022.7271 1027.3786 1040.9286 1045.7024 1068.0554 1073.5185 1079.3032 1080.6199 1084.5752 1105.7945 1123.5672 1160.4275 1182.0093 1201.6951 1204.6878 1230.6623 1231.2275 1254.4723 1257.6859 1273.3150 1275.2515 1280.6512 1282.8277 1287.6506 1289.9565 1292.9737 1296.8296 1303.2220 1310.5412 1329.1631 1343.8168 1351.4809 1352.1702 1355.7154 1355.7276 1387.8766 1443.2055 1458.3717 1458.4736 1461.5492 1461.8976 1464.1160 1467.8996 1472.9739 1476.1991 1478.0613 1482.7731 1486.4885 1488.5756 1671.8273 2947.8454 2948.0987 2950.1155 2950.6612 2953.1840 2955.5542 2960.0342 2964.5538 2967.7872 2970.7549 2981.1946 2982.7151 2984.4736 2989.1609 2995.4601 3003.2254 3013.1441 3013.4054 3023.7541 3033.2318 3040.8687 3048.6255 3067.2240 3069.6976 3080.7315 3524.1384
redmass: 1.6653 4.6731 5.1503 4.6273 5.2360 1.8443 4.1004 4.4336 1.7355 3.0585 4.0350 1.8254 6.1137 2.4682 2.0102 2.2067 5.3175 5.6126 6.4633 1.1222 6.1542 4.1924 5.6178 3.4719 3.4691 9.5044 4.2836 3.1640 3.3797 2.9928 2.2345 2.8420 3.3705 2.6568 1.0583 1.0668 1.0825 1.1466 1.6523 2.4505 1.4118 1.5455 1.5791 1.8777 1.4104 1.2954 5.3446 3.6547 1.3269 4.4140 1.2351 3.1847 2.1724 3.0091 2.7842 2.8845 2.1351 2.2066 2.4898 3.4585 2.9773 1.8962 1.8320 1.2651 1.5520 1.3996 1.2987 1.3107 1.2984 1.2278 1.0383 1.2278 1.1065 1.1984 1.0805 1.1887 1.1820 1.4043 1.4721 1.3878 1.4420 1.5342 1.7030 1.6405 1.6045 1.2168 1.0834 1.0731 1.0734 1.0693 1.0682 1.0702 1.0840 1.0849 1.0428 1.0867 1.0910 1.0945 1.0943 10.3605 1.0586 1.0586 1.0590 1.0591 1.0592 1.0593 1.0590 1.0585 1.0585 1.0366 1.0959 1.0621 1.0956 1.0982 1.1002 1.1022 1.0743 1.0877 1.1045 1.1046 1.1044 1.1034 1.1007 1.0992 1.1037 1.0644
irintensity: 0.0532 0.2487 0.2424 0.4816 0.6794 0.1345 0.3419 0.1101 0.0113 0.0294 0.0948 0.0015 0.3529 0.0937 0.0147 0.0922 0.2664 0.5908 0.0880 0.0004 1.3250 1.0815 1.0440 2.0977 2.2130 0.4081 3.7952 2.9256 2.0199 0.8037 10.3131 53.0151 67.3214 193.4492 18.5439 0.1367 8.2480 1.0872 4.1622 31.1897 5.3814 2.2381 15.2541 3.7027 14.4892 23.0053 0.9328 2.8449 16.9023 1.9238 45.8160 4.4750 109.3937 20.6717 1.1126 0.2585 0.1132 0.0812 0.6260 43.0323 10.7840 6.3442 0.5397 27.0487 0.1774 0.5901 2.0412 0.9893 4.0741 0.7956 0.5982 2.7042 1.0194 2.0617 0.0346 1.0632 2.1251 3.0843 3.1045 2.9602 0.8874 1.5652 0.3302 0.0770 0.3791 11.1432 7.0440 0.0088 0.0697 0.0373 0.1397 0.3276 0.4625 1.0066 12.3284 1.3855 2.0497 4.9673 38.6824 194.3092 0.0039 0.0700 0.0025 0.5671 0.0334 2.5013 3.3878 93.0695 209.7424 37.2292 0.0880 35.7951 1.7899 0.6369 0.4821 0.5293 6.3806 4.9937 5.1666 0.6722 173.8630 124.0178 99.1154 55.3749 23.8121 41.0932
temp: 298.150 k
press: 1.00000 atm
elementType: 17 17 8 8 6 6 6 6 6 6 6 6 6 6 6 6 6 6 1 1 1 1 1 1 1 1 1 1 1 1 1 1 1 1 1 1 1 1 1 1 1 1 1 1
symmnumber: 1
zpe: 984634.6 jmol-1
zpe.correction: 0.375028 hartree
zpe.thermalcorrener: 0.397740 hartree
zpe.thermalcorrenthalpy: 0.398685 hartree
zpe.thermalcorrgfe: 0.317328 hartree
zpe.sumelectzpe: -1618.186570 hartree
zpe.sumelectthermal: -1618.163858 hartree
zpe.sumelectthermalent: -1618.162913 hartree
zpe.sumelectthermalfe: -1618.244270 hartree
dipole: 3.0924 0.9988 -1.9700
dipole: 3.8001
quadrupole: -154.2058 -120.4564 -130.0672
quadrupole: -5.5917 10.9276 -5.5599
quadrupole: -19.2960 14.4534 4.8426 -5.5917 10.9276 -5.5599
hfenergy: -1618.561598 hartree
pointgroup: C01 [X(C14H26Cl2O2)]
dipole: 1.2008423 -0.3023801 0.8377596 debye
polarizability: 228.4557014|-6.6062946|151.4172552|-1.6559791|3.336525|161.3732849 unknown
InChI: InChI=1S/C14H26Cl2O2/c1-2-3-4-5-6-7-8-9-10-11-12-14(15,16)13(17)18/h17H,2-12H2,1H3
charge 0 multiplicity 1
44 atoms
Cl -6.854211 1.33873 0.816111
Cl -5.617853 0.946112 -1.940272
O  -5.36506 -1.497052 1.240934
O  -6.354772 -1.772751 -0.84404
C  2.254302 -0.100075 -0.243138
C  1.002854 0.549641 0.389132
C  3.580436 0.401882 0.371084
C  -0.322259 0.057223 -0.234921
C  4.832667 -0.245498 -0.262193
C  -1.571056 0.708453 0.400321
C  6.159234 0.263713 0.345484
C  -2.892191 0.223979 -0.240222
C  7.412257 -0.380228 -0.289848
C  -4.115853 0.901857 0.421195
C  8.738717 0.133407 0.315563
C  -5.46429 0.458783 -0.146888
C  9.985509 -0.513379 -0.325946
C  -5.791106 -1.044278 -0.011488
H  2.192405 -1.202814 -0.12982
H  2.258318 0.099792 -1.335181
H  1.069974 1.652693 0.282211
H  0.994603 0.343277 1.479951
H  3.577776 0.202416 1.463305
H  3.641685 1.504694 0.257439
H  -0.389118 -1.045858 -0.130224
H  -0.313744 0.266282 -1.324856
H  4.832348 -0.050478 -1.355203
H  4.775222 -1.348032 -0.144102
H  -1.498872 1.811664 0.301756
H  -1.585175 0.49108 1.488457
H  6.21544 1.366508 0.22849
H  6.161062 0.067528 1.438369
H  -2.967196 -0.876582 -0.133103
H  -2.882607 0.445974 -1.324394
H  7.359752 -1.482988 -0.1709
H  7.410697 -0.186162 -1.383088
H  -4.127091 0.67383 1.502833
H  -4.049027 1.999665 0.309233
H  8.789659 1.23522 0.197265
H  8.739599 -0.06166 1.40759
H  9.974576 -1.611894 -0.192986
H  10.022658 -0.308765 -1.412769
H  10.919775 -0.128096 0.122647
H  -5.63304 -2.449115 1.352011
