program: Gaussian 09
title: 000185249
version: EM64L-G09RevD.01
frameworkgroup: C1[X(C13H24O5)]
method: RPBEPBE
basis: SDD
operation: Freq
keyword: #pfreq=noraman
keyword: PBEPBE/SDD
title: #p freq=noraman PBEPBE/SDD
converged: YES YES NO NO
title: Mulliken charges:
elementType: O O O O O C C C C C C C C C C C C C H H H H H H H H H H H H H H H H H H H H H H H H
charge: -0.254251 -0.224596 -0.246996 -0.240377 -0.272281 -0.147938 -0.406306 -0.403382 -0.358453 -0.361576 0.241590 -0.697299 -0.698828 0.022138 -0.688490 0.347867 -0.270850 -0.663949 0.229993 0.197838 0.218849 0.196588 0.214512 0.212371 0.196013 0.194567 0.236997 0.217403 0.216220 0.207809 0.220052 0.204572 0.213275 0.274000 0.245137 0.229731 0.229934 0.228506 0.239190 0.219403 0.230858 0.250159
chargesum: 0.00000
title: Mulliken charges with hydrogens summed into heavy atoms:
elementType: O O O O O C C C C C C C C C C C C C
charge: -0.254251 -0.224596 -0.246996 -0.240377 -0.272281 0.082054 0.010380 0.007717 0.049931 0.069987 0.241590 -0.055867 -0.060930 0.296138 0.016313 0.347867 0.196846 0.036472
polarizability: 1.81963811e+02 -6.56144412e+00 1.56503270e+02 3.73395561e+00 -3.64784604e+00 1.40410102e+02
1716.lowfreq: -7.6422 -1.8069 -0.0003 0.0005 0.0006 1.6781 14.5352 20.4927 22.5219
frequency: 13.8273 19.8913 22.4051 40.4361 60.0479 68.7061 74.6066 80.4729 89.4799 91.3072 96.3933 134.8942 142.0796 169.2041 187.7035 216.7815 227.4250 230.3248 231.5898 252.3268 262.5514 274.5522 284.1818 303.7064 314.7823 391.7156 419.0883 445.5915 471.2600 510.4575 530.5253 639.9370 661.2532 689.3383 710.8414 746.7901 750.0045 792.7127 794.3055 804.3539 829.8216 858.5255 860.1868 874.4178 909.6863 919.5779 951.8406 997.7618 1024.3822 1032.8328 1044.0210 1055.7138 1063.2468 1067.5180 1077.8789 1093.2148 1097.6936 1111.8706 1126.1805 1143.2237 1153.7843 1161.0542 1191.8802 1219.6389 1232.6285 1253.0426 1278.0503 1286.8769 1293.1645 1303.2360 1312.1648 1321.7669 1347.2650 1348.3569 1353.8178 1359.7785 1366.5564 1390.0640 1390.5532 1391.0754 1400.4376 1454.0642 1458.6195 1460.9140 1462.7304 1463.2783 1465.3536 1471.0356 1473.4702 1477.4377 1478.2039 1484.6197 1485.7350 1487.1608 1634.0424 1652.8645 2967.1950 2969.3173 2972.4619 2973.9152 2977.5363 2979.9828 2993.8392 3008.2904 3009.1823 3012.3622 3021.0517 3033.5642 3040.1964 3049.6722 3055.5447 3069.1886 3070.7460 3074.4805 3074.6707 3089.0692 3096.3230 3110.6485 3119.5669 3123.4421
redmass: 3.9542 3.9621 4.4002 3.4827 3.2407 1.5891 4.8657 4.5116 3.3522 1.6930 4.3731 4.3759 3.2864 2.5467 2.5105 1.0695 1.1364 1.3238 1.2121 2.9128 3.1135 3.7706 4.3245 3.7909 3.3873 3.4131 4.2783 3.4815 3.7070 3.5072 4.7428 2.6434 5.4626 10.9048 2.1199 1.5392 1.2705 3.7362 1.5722 2.4329 2.9206 1.6344 2.0236 2.0994 1.5247 1.5778 3.0622 4.4796 1.8055 3.5591 2.3077 2.4474 1.8023 2.9260 2.5426 2.1100 2.0710 2.0827 1.8944 2.5370 2.2979 1.7827 5.1663 1.4165 1.3541 1.2083 1.1151 1.2205 1.1167 1.1735 1.3117 1.2504 1.2663 1.4871 1.5362 1.2840 1.5073 1.2347 1.2141 1.2134 1.2970 1.0782 1.0817 1.0433 1.0798 1.0564 1.0491 1.0672 1.0583 1.0420 1.0432 1.0712 1.0534 1.0806 9.1109 9.7780 1.0583 1.0554 1.0398 1.0377 1.0604 1.0593 1.0360 1.0359 1.0951 1.0958 1.0936 1.0605 1.1038 1.1006 1.0877 1.1011 1.1006 1.0994 1.0993 1.0972 1.1025 1.1000 1.1005 1.1066
irintensity: 0.1887 0.7711 0.3078 0.2132 0.6387 0.0879 2.6931 0.3076 0.2391 0.0806 1.2915 1.2160 2.7083 1.2537 0.5201 0.8288 0.0901 0.7914 0.4190 0.2809 0.3719 2.6930 5.3424 1.8285 26.4852 2.7430 19.5070 3.5695 4.0129 3.8404 1.4749 0.7511 1.3159 10.7602 2.2217 3.3203 18.5388 145.6714 19.1506 17.5914 24.4984 32.2438 48.3529 3.8076 3.4133 44.2007 129.7629 66.4388 4.3288 54.9306 410.4815 1.7529 24.1564 100.6785 17.5922 107.8735 0.9897 4.6493 27.8248 9.6675 70.5787 10.6406 561.8772 0.2030 9.2920 1.9612 6.3894 1.2691 0.7378 6.1432 0.5177 18.3224 6.7250 0.5109 13.9332 2.9141 12.7490 25.7364 11.8844 7.4145 31.7189 0.1318 23.9768 9.1726 6.6604 11.1262 8.2150 4.7481 4.9181 9.9876 14.4685 11.4527 15.2668 19.6390 152.4648 178.5875 18.3005 6.5505 34.7439 26.1924 1.9378 114.7191 17.7424 7.8707 4.6689 3.8344 7.1393 24.4871 0.1120 28.1402 4.9115 46.7502 111.9587 38.5145 60.6392 32.5398 1.6969 18.9920 12.3090 29.6264
temp: 298.150 k
press: 1.00000 atm
elementType: 8 8 8 8 8 6 6 6 6 6 6 6 6 6 6 6 6 6 1 1 1 1 1 1 1 1 1 1 1 1 1 1 1 1 1 1 1 1 1 1 1 1
symmnumber: 1
zpe: 933352.9 jmol-1
zpe.correction: 0.355495 hartree
zpe.thermalcorrener: 0.378120 hartree
zpe.thermalcorrenthalpy: 0.379064 hartree
zpe.thermalcorrgfe: 0.299828 hartree
zpe.sumelectzpe: -884.452884 hartree
zpe.sumelectthermal: -884.430260 hartree
zpe.sumelectthermalent: -884.429316 hartree
zpe.sumelectthermalfe: -884.508551 hartree
dipole: 0.0959 0.4293 1.0106
dipole: 1.1022
quadrupole: -92.6204 -108.9770 -109.7906
quadrupole: -1.8610 4.1268 -7.2256
quadrupole: 11.1756 -5.1810 -5.9946 -1.8610 4.1268 -7.2256
hfenergy: -884.8083796 hartree
pointgroup: C01 [X(C13H24O5)]
dipole: 0.0636581 -0.1933728 -0.3828944 debye
polarizability: 180.7275872|8.6617669|157.2544468|-2.9319768|-4.9795622|140.8951496 unknown
InChI: InChI=1S/C13H24O5/c1-5-8-11(9-6-2)12(14)17-10(4)18-13(15)16-7-3/h10-11H,5-9H2,1-4H3
charge 0 multiplicity 1
42 atoms
O  0.608415 0.616346 -1.257637
O  0.505453 0.509402 1.076166
O  -1.670159 0.064414 -1.006409
O  -3.186028 -0.947426 0.26945
O  -2.847824 1.358794 0.574228
C  2.47542 -0.416689 -0.101874
C  3.52318 0.301595 0.792035
C  2.311642 -1.913648 0.303988
C  3.840287 1.747743 0.348682
C  1.34413 -2.715634 -0.596205
C  1.126597 0.274149 0.018765
C  4.917878 2.410566 1.23319
C  1.274341 -4.203882 -0.19271
C  -0.741211 1.193623 -1.276337
C  -0.987611 1.733424 -2.671534
C  -2.594202 0.26924 0.016163
C  -4.266966 -0.925591 1.308235
C  -5.595935 -0.461429 0.709267
H  2.788989 -0.363883 -1.161502
H  4.454904 -0.299013 0.777388
H  3.156757 0.305338 1.837553
H  3.316692 -2.381097 0.27138
H  1.968457 -1.95878 1.35686
H  2.914726 2.357027 0.382224
H  4.175617 1.743024 -0.708441
H  1.669831 -2.62967 -1.652579
H  0.329646 -2.274022 -0.548914
H  5.134875 3.442208 0.900988
H  4.588612 2.457382 2.288129
H  5.864762 1.838819 1.201933
H  0.576572 -4.762773 -0.842456
H  2.267554 -4.686675 -0.26737
H  0.924603 -4.314676 0.851047
H  -0.856346 1.933636 -0.464163
H  -0.909867 0.920812 -3.412115
H  -1.995444 2.177682 -2.728099
H  -0.242034 2.510002 -2.912102
H  -4.306106 -1.97342 1.644387
H  -3.943186 -0.270808 2.136061
H  -6.394401 -0.549639 1.469284
H  -5.875783 -1.08373 -0.158117
H  -5.538635 0.593757 0.393662
