program: Gaussian 09
title: 000185243
version: EM64L-G09RevD.01
frameworkgroup: C1[X(C26H27NO3)]
method: RPBEPBE
basis: SDD
operation: Freq
keyword: #p
keyword: freq=noraman
keyword: PBEPBE/SDD
title: #p freq=noraman PBEPBE/SDD
converged: NO YES NO NO
title: Mulliken charges:
elementType: O O O N C C C C C C C C C C C C C C C C C C C C C C C C C C H H H H H H H H H H H H H H H H H H H H H H H H H H H
charge: -0.272814 -0.229321 -0.311261 0.007672 0.285844 -0.223061 -0.143280 -0.079339 -0.481974 -0.575349 -0.493938 -0.485906 -0.510289 -0.461593 -0.453376 0.185974 -0.182909 0.546026 -0.198530 -0.528514 -0.444522 0.347192 -0.197002 -0.391854 0.348738 -0.353870 -0.382730 -0.205158 -0.192324 -0.247911 0.262478 0.220493 0.212320 0.205783 0.239345 0.209004 0.253372 0.226590 0.231849 0.226785 0.211019 0.237904 0.208261 0.199841 0.210137 0.215357 0.210749 0.281112 0.286609 0.265613 0.234935 0.263712 0.262416 0.258276 0.228629 0.231399 0.231389
chargesum: 0.00000
title: Mulliken charges with hydrogens summed into heavy atoms:
elementType: O O O N C C C C C C C C C C C C C C C C C C C C C C C C C C
charge: -0.272814 -0.229321 -0.311261 0.007672 0.285844 0.039417 0.077214 0.132981 -0.036846 -0.112973 -0.035499 -0.048102 -0.064123 -0.051614 -0.027270 0.185974 0.098203 0.546026 -0.198530 -0.241905 -0.178909 0.347192 0.037933 -0.128141 0.348738 -0.091455 -0.124454 0.023471 0.039075 -0.016521
polarizability: 3.28825302e+02 -1.80092900e+01 2.77644139e+02 -1.04949097e+01 2.75408495e+01 2.42877340e+02
1716.lowfreq: -4.7606 -1.7519 -0.0007 0.0006 0.0008 5.9085 8.6886 14.2652 22.8311
frequency: 6.7937 11.6905 22.1640 24.9350 40.1338 52.4011 57.9251 77.1187 88.6231 112.9831 142.0913 158.1080 181.4878 195.4359 204.5599 218.4692 235.9184 248.1980 271.4165 287.9760 300.4244 318.5062 332.2499 349.6954 379.8252 382.8644 399.6526 406.3766 409.1113 423.5891 439.2717 454.4372 469.2394 479.7537 533.8519 551.8000 562.2356 584.2888 610.9416 620.3887 634.1060 642.9511 651.7838 688.8378 691.2130 698.5347 712.1091 725.1823 741.8752 751.6843 763.9565 774.8069 799.3656 804.7593 819.7074 833.6195 835.6775 843.3765 853.2177 873.4689 881.3255 901.3490 903.0622 913.9252 915.8165 917.0282 922.1529 955.6746 959.1330 968.3740 974.2428 980.7694 984.1636 986.5520 987.2582 988.6231 988.7536 994.9544 1005.1638 1019.4465 1044.9769 1053.5327 1072.5121 1077.3374 1087.2991 1088.6434 1098.1933 1125.7278 1135.1566 1141.8131 1149.6498 1154.9752 1167.8212 1172.4934 1177.7063 1181.3044 1195.2829 1196.8960 1199.4664 1224.7459 1235.3493 1236.0792 1241.4027 1276.0796 1278.0717 1281.5558 1283.7661 1289.7877 1300.5688 1307.6382 1307.7128 1310.3014 1321.5407 1328.3170 1329.6599 1340.4206 1344.1813 1356.2357 1360.5657 1381.6909 1392.0899 1440.3399 1445.8612 1460.8552 1465.2262 1470.0197 1470.2553 1475.0818 1478.9162 1482.3382 1500.6559 1514.6208 1594.4684 1595.4183 1606.1457 1613.4569 1618.1390 2203.7268 2962.1169 2973.3615 2978.4496 2989.5025 2994.7319 2996.7262 3000.8243 3007.1366 3016.0928 3016.3499 3020.1549 3037.9255 3042.5258 3048.3357 3058.3881 3070.3997 3077.9484 3126.9371 3132.3394 3141.5298 3141.6544 3150.0458 3156.1853 3158.5919 3165.5084 3175.6094 3175.9704
redmass: 3.8677 6.0577 5.1422 5.0045 4.7013 8.3679 5.5560 6.0275 7.6788 5.1420 3.9351 3.7075 4.7774 2.4368 2.4549 4.5182 5.2709 5.5444 3.5318 2.2259 5.3340 4.8293 5.2510 4.3696 4.4970 4.1688 3.3264 3.0270 2.9132 4.5553 5.0218 3.5867 1.8901 3.3207 3.2855 7.0559 7.7430 6.0387 6.3656 6.3451 4.6120 6.1814 2.0146 5.0552 2.5475 2.6234 4.4670 3.9473 3.6004 2.6471 1.7308 1.8293 1.4460 1.6578 4.2646 1.3386 3.5721 3.8992 2.6400 2.0955 2.7820 1.4664 2.4611 1.5154 2.2620 1.6059 2.1876 4.2112 2.2964 1.3676 1.7526 1.8757 1.7249 4.1820 2.6339 1.5077 2.1150 4.1925 3.5621 2.0853 1.5919 2.0945 1.8019 1.5024 1.5779 1.6028 1.6716 2.0532 1.8641 1.8746 1.7404 1.1846 1.1925 1.1443 1.1326 1.3568 2.2243 1.5000 1.4550 1.6432 2.3514 1.3998 1.4460 1.3935 1.3529 1.5941 1.3694 1.3290 1.6437 1.3609 1.3479 1.6337 1.4067 1.3801 1.4765 1.3377 1.4661 1.4021 1.4822 7.9867 7.7322 2.3736 2.5302 1.0764 1.0822 1.2948 1.7139 1.0767 2.5382 1.0952 1.0803 1.0860 6.4177 6.4499 6.4901 6.6423 11.4387 12.5919 1.0694 1.0669 1.0716 1.0722 1.0618 1.0657 1.0687 1.0661 1.0991 1.0824 1.0824 1.0978 1.0899 1.1018 1.0999 1.1030 1.0960 1.0896 1.0850 1.0883 1.0880 1.0923 1.0931 1.0935 1.0967 1.0988 1.1001
irintensity: 0.0883 0.0962 0.0428 0.7146 0.9400 1.2859 1.5570 1.4882 1.5978 0.3558 0.8308 2.3645 0.2959 0.7162 1.0245 1.8609 3.5060 8.5765 0.6634 1.1903 0.1784 1.2637 6.9360 1.5861 1.5881 3.1083 0.7174 0.3533 0.4729 3.4882 2.0691 6.3316 0.8547 24.1732 1.0015 5.8190 0.4672 1.7662 4.3980 7.0548 2.5489 9.5408 0.7628 6.7732 40.2285 21.2815 0.5592 1.9771 2.1188 5.1651 94.0821 1.6562 5.5085 75.5993 24.5061 6.3982 26.5303 37.6574 42.2712 2.0614 1.1780 7.8594 3.4994 17.9824 24.4844 0.6467 9.9622 25.4594 25.5529 0.3965 0.0507 27.2362 4.3174 16.0879 9.9964 0.6004 2.0167 130.0425 94.0009 12.3303 1.1366 32.5127 11.2556 11.5723 0.9746 5.4972 6.3685 23.0042 82.6320 6.2682 52.8463 3.0001 41.9953 35.9255 1.5915 1.5076 112.8116 7.4113 6.5866 35.4413 195.3362 13.3535 0.3332 7.7724 13.0201 62.4825 5.6517 1.4953 2.9321 1.2445 0.4166 1.0172 0.8591 0.0927 13.8290 0.1731 1.4849 0.1698 1.9359 7.4951 7.5381 18.9815 52.5563 2.4323 10.9605 54.9226 98.8508 2.6317 24.2192 28.5371 28.9752 3.6072 5.7752 154.7729 36.1364 15.1961 114.1390 1.8794 9.5387 13.3004 82.1737 33.7173 18.6008 42.0754 53.5420 57.9693 16.1748 25.4068 109.2065 24.7278 11.3525 3.0922 42.5523 80.2973 17.4401 24.2574 1.6453 6.2560 8.5000 4.4082 23.5335 6.0666 14.8670 10.5791 5.4790
temp: 298.150 k
press: 1.00000 atm
elementType: 8 8 8 7 6 6 6 6 6 6 6 6 6 6 6 6 6 6 6 6 6 6 6 6 6 6 6 6 6 6 1 1 1 1 1 1 1 1 1 1 1 1 1 1 1 1 1 1 1 1 1 1 1 1 1 1 1
symmnumber: 1
zpe: 1228770.3 jmol-1
zpe.correction: 0.468014 hartree
zpe.thermalcorrener: 0.493642 hartree
zpe.thermalcorrenthalpy: 0.494587 hartree
zpe.thermalcorrgfe: 0.408294 hartree
zpe.sumelectzpe: -1285.191493 hartree
zpe.sumelectthermal: -1285.165865 hartree
zpe.sumelectthermalent: -1285.164920 hartree
zpe.sumelectthermalfe: -1285.251213 hartree
dipole: 1.3976 2.0292 -2.9757
dipole: 3.8634
quadrupole: -166.7154 -168.2995 -186.6317
quadrupole: 1.1429 2.0564 7.3785
quadrupole: 7.1668 5.5827 -12.7495 1.1429 2.0564 7.3785
hfenergy: -1285.659507 hartree
pointgroup: C01 [X(C26H27N1O3)]
dipole: 0.8118757 -0.6350609 1.1170979 debye
polarizability: 315.5432548|30.4109821|290.083329|-1.0363138|28.4647149|243.7201968 unknown
InChI: InChI=1S/C26H27NO3/c27-17-24(19-6-4-10-23(15-19)29-22-8-2-1-3-9-22)30-25(28)26-13-5-7-20(16-26)18-11-12-21(26)14-18/h1-4,6,8-10,15,18,20-21,24H,5,7,11-14,16H2
charge 0 multiplicity 1
57 atoms
O  0.353038 0.749315 -0.740804
O  1.3287 2.669402 0.153746
O  -4.680644 -0.980464 1.084775
N  -1.67057 0.811875 -3.469362
C  2.617444 0.531287 0.097816
C  3.221825 0.205038 -1.332254
C  5.429427 0.039882 -0.453194
C  4.941292 0.362426 0.998177
C  4.385047 -0.811745 -1.219774
C  3.682101 1.261058 0.952779
C  3.983874 1.441024 -1.919228
C  5.446896 1.32943 -1.339984
C  2.136502 -0.728037 0.90339
C  4.608425 -0.875898 1.88012
C  3.268379 -1.60437 1.53499
C  1.415314 1.451998 -0.125312
C  -0.886501 1.5663 -1.037298
C  -1.925765 1.353349 0.053057
C  -1.319648 1.140194 -2.378357
C  -2.799384 0.241236 0.016554
C  -1.984019 2.277771 1.125118
C  -3.72152 0.05651 1.07016
C  -2.925588 2.085578 2.160572
C  -3.796676 0.976503 2.140795
C  -4.405162 -2.250265 0.506134
C  -3.143319 -2.879282 0.615445
C  -5.500629 -2.905062 -0.095946
C  -2.983943 -4.182822 0.094773
C  -5.326616 -4.210177 -0.606643
C  -4.069053 -4.852357 -0.517776
H  2.410558 -0.145128 -1.994406
H  6.422655 -0.445416 -0.408194
H  5.756509 0.922982 1.500665
H  4.760156 -1.042105 -2.237115
H  4.12412 -1.766377 -0.746556
H  3.293135 1.427929 1.976286
H  3.902394 2.258122 0.538837
H  3.502124 2.401814 -1.6633
H  3.996673 1.370066 -3.022134
H  6.180032 1.21264 -2.159154
H  5.740499 2.22621 -0.764446
H  1.492826 -1.357807 0.262632
H  1.487177 -0.351923 1.719383
H  4.558695 -0.516747 2.927683
H  5.438289 -1.609277 1.842628
H  3.477606 -2.458805 0.868493
H  2.86629 -2.05584 2.463159
H  -0.574718 2.628888 -1.061571
H  -2.771367 -0.459968 -0.824303
H  -1.293509 3.127453 1.148901
H  -2.980547 2.800748 2.987742
H  -4.535039 0.809697 2.930536
H  -2.307443 -2.369011 1.10438
H  -6.463202 -2.388348 -0.153276
H  -2.009519 -4.676976 0.176221
H  -6.173176 -4.722132 -1.076814
H  -3.936647 -5.86289 -0.918144
