program: Gaussian 09
title: 000187825
version: EM64L-G09RevD.01
frameworkgroup: C1[X(C10H10O2)]
method: RPBEPBE
basis: SDD
operation: Freq
keyword: #pfreq=noraman
keyword: PBEPBE/SDD
title: #p freq=noraman PBEPBE/SDD
converged: YES YES NO NO
title: Mulliken charges:
elementType: O O C C C C C C C C C C H H H H H H H H H H
charge: -0.438203 -0.438241 0.149953 0.149723 -0.193478 -0.193266 -0.269533 -0.269597 -0.343922 -0.343978 -0.236659 -0.236629 0.244490 0.244524 0.250322 0.250330 0.271869 0.271886 0.231228 0.231229 0.333981 0.333971
chargesum: 0.00000
title: Mulliken charges with hydrogens summed into heavy atoms:
elementType: O O C C C C C C C C C C
charge: -0.104222 -0.104270 0.149953 0.149723 0.051012 0.051258 -0.019211 -0.019267 -0.072053 -0.072092 -0.005431 -0.005400
polarizability: 1.28191406e+02 1.48823040e-03 1.28672677e+02 -3.37923336e+00 1.25460584e-02 6.20922277e+01
1716.lowfreq: -12.9650 -10.0963 -0.0008 -0.0003 0.0002 7.9276 50.7143 104.5887 171.2035
frequency: 50.6691 104.5862 171.2014 219.8539 255.6174 305.8636 338.8659 374.2417 381.5094 433.1450 444.4798 470.0232 490.7438 526.5298 608.1347 610.7619 694.1448 717.3225 760.5081 768.2055 826.5142 834.3824 892.4948 916.6464 959.5166 968.6535 996.0513 997.2932 1002.2387 1038.0369 1045.1122 1110.1992 1154.7018 1173.4991 1192.2827 1197.9840 1198.1964 1202.4227 1249.6203 1308.1098 1308.7545 1347.0810 1353.9250 1367.9691 1382.7740 1439.9088 1477.1280 1585.8102 1613.3398 1672.0526 2995.8023 2996.3384 3119.5352 3127.2656 3139.8709 3148.9912 3151.7537 3164.7747 3540.8764 3541.2488
redmass: 4.7406 4.1658 4.0727 3.3638 4.3193 3.4124 1.2448 3.4244 1.3751 4.2603 3.9080 4.7335 4.1608 4.0337 3.1702 4.0186 3.2880 4.9823 5.2502 1.2070 1.8380 3.4296 1.4227 4.4014 6.2314 1.3845 1.3180 1.2742 4.1051 2.3408 2.1660 1.8042 1.1749 1.0569 1.6177 1.2209 1.3554 1.6252 1.5589 2.0295 1.7332 1.1623 1.1507 1.6190 9.2121 2.4540 2.5709 7.2289 6.4368 7.6089 1.0821 1.0825 1.0846 1.0852 1.0894 1.0998 1.0946 1.1007 1.0661 1.0661
irintensity: 2.7768 0.2192 0.5578 0.5895 0.0491 3.9800 1.4955 29.1441 254.0329 15.2650 0.0892 0.8802 16.5533 0.0774 6.5745 0.0199 0.8770 3.9034 0.4326 128.1254 29.6761 39.5407 9.1180 87.5343 76.8876 0.2855 0.0227 0.0800 12.4830 0.2184 0.5056 1.4441 6.4364 0.7446 0.6526 11.2552 35.9525 11.2556 0.0174 16.5342 0.7578 59.7832 12.1147 19.3854 0.1502 10.8021 13.5991 0.8608 0.1306 1.3033 25.6466 3.2973 2.1465 1.5146 5.9960 33.5577 12.7186 23.8731 8.2278 3.3742
temp: 298.150 k
press: 1.00000 atm
elementType: 8 8 6 6 6 6 6 6 6 6 6 6 1 1 1 1 1 1 1 1 1 1
symmnumber: 1
zpe: 457365.6 jmol-1
zpe.correction: 0.174201 hartree
zpe.thermalcorrener: 0.184325 hartree
zpe.thermalcorrenthalpy: 0.185269 hartree
zpe.thermalcorrgfe: 0.138672 hartree
zpe.sumelectzpe: -536.615625 hartree
zpe.sumelectthermal: -536.605501 hartree
zpe.sumelectthermalent: -536.604557 hartree
zpe.sumelectthermalfe: -536.651154 hartree
dipole: -0.3817 0.0005 0.9195
dipole: 0.9955
quadrupole: -63.2375 -80.3696 -66.7795
quadrupole: -0.0036 0.0912 0.0103
quadrupole: 6.8914 -10.2407 3.3494 -0.0036 0.0912 0.0103
hfenergy: -536.789826 hartree
pointgroup: C01 [X(C10H10O2)]
dipole: -0.1202249 0.003222 0.3727533 debye
dipolederiv: -0.6858609 0.0716816 0.0065274 0.1050906 -0.6366771 0.2491839 -0.0275179 0.3077544 -0.3203475 -0.6920394 -0.0697677 -0.0021861 -0.1031576 -0.6332044 -0.2476185 -0.0380519 -0.3048734 -0.3172589 -0.0375573 -0.0412706 -0.0367969 -0.0761383 -0.0708377 0.0580907 -0.0591242 0.028076 -0.0803936 -0.0333124 0.0397204 -0.0392328 0.0745148 -0.0754299 -0.0567807 -0.0609737 -0.0261708 -0.0798125 0.4231328 -0.0150983 -0.0078921 -0.0962736 0.4791489 -0.1396828 0.014137 -0.2496356 0.4765729 0.4268935 0.0170564 -0.0029048 0.0981893 0.4772555 0.1399972 0.0227472 0.249598 0.4744167 0.0609093 -0.0274446 0.0462249 0.0421583 -0.0348932 0.0403651 0.0251491 0.0874006 -0.2554938 0.0603434 0.024137 0.0446925 -0.0454995 -0.0350025 -0.043024 0.0223022 -0.0896244 -0.2547769 -0.138864 -0.0023585 -0.0182049 0.0384708 0.0833416 -0.0039323 0.0405176 -0.0045191 -0.1448325 -0.1399291 0.0102426 -0.0180682 -0.0302521 0.0843056 0.0035684 0.0408343 0.0019618 -0.1449047 0.0699101 0.0827837 -0.0443259 0.054263 -0.014669 -0.0186349 -0.0504436 -0.0164618 -0.150792 0.0648766 -0.0858026 -0.043301 -0.0573259 -0.0094031 0.0196599 -0.049539 0.0177096 -0.1509409 0.0093718 -0.0274418 -0.0014594 0.0313305 -0.0557926 -0.0778753 0.001996 -0.0191388 -0.0616452 0.0091072 0.0251094 0.0012404 -0.0336573 -0.0550993 0.0777405 0.0028651 0.0189319 -0.0621334 -0.0923704 0.0658966 -0.0014232 0.0919213 0.0375501 -0.006023 -0.0246126 -0.0024315 0.1596511 -0.0978656 -0.0610066 -0.0009323 -0.0871707 0.0431251 0.0066058 -0.0240959 0.0039083 0.1596151 0.110971 0.0139049 0.0129929 -0.0223754 -0.0525484 -0.0015921 0.0169492 0.0000235 0.1479509 0.1110996 -0.0196809 0.0131104 0.0165822 -0.0526329 0.0019699 0.0168912 0.000268 0.147937 -0.083256 -0.083636 0.0412059 -0.0917654 0.0391969 0.0165886 0.044574 0.0206981 0.1492726 -0.0767675 0.0879887 0.0402399 0.0961199 0.0325519 -0.0175861 0.0433814 -0.021831 0.1494372 0.3643319 -0.033744 0.0023951 -0.0413477 0.2253226 -0.1597421 0.0186743 -0.1344201 0.0800667 0.3668753 0.0287303 0.008098 0.0363226 0.2243919 0.1587219 0.02334 0.1327763 0.0784117 unknown
polarizability: 127.2064624|0.0081429|128.6725457|-8.6926152|0.0126443|63.0773018 unknown
InChI: InChI=1S/C10H10O2/c11-9-5-6-10(12)8-4-2-1-3-7(8)9/h1-6,9-12H
charge 0 multiplicity 1
22 atoms
O  1.117661 -2.714062 0.382578
O  1.214764 2.675692 0.368813
C  -0.210526 -0.706366 -0.272193
C  -0.184839 0.713372 -0.275208
C  1.051723 -1.532339 -0.519622
C  1.106242 1.492069 -0.526804
C  2.324641 -0.720696 -0.420808
C  2.349085 0.635541 -0.423752
C  -1.435544 -1.382172 -0.037883
C  -1.384639 1.433932 -0.043759
C  -2.625042 -0.659955 0.186633
C  -2.59942 0.756144 0.183722
H  0.996617 -2.017582 -1.513874
H  1.068547 1.973527 -1.523715
H  3.250513 -1.306609 -0.365855
H  3.295415 1.18805 -0.371316
H  -1.43515 -2.477417 -0.0249
H  -1.344836 2.528496 -0.03551
H  -3.565248 -1.193769 0.364223
H  -3.519749 1.324242 0.359013
H  1.15093 -2.382209 1.317193
H  1.235858 2.348208 1.305324
