program: Gaussian 09
title: 000185228
version: EM64L-G09RevD.01
frameworkgroup: C1[X(C16H12O3)]
method: RPBEPBE
basis: SDD
operation: Freq
keyword: #pfreq=noraman
keyword: PBEPBE/SDD
title: #p freq=noraman PBEPBE/SDD
converged: YES YES NO NO
title: Mulliken charges:
elementType: O O O C C C C C C C C C C C C C C C C H H H H H H H H H H H H
charge: -0.274088 -0.235580 -0.218024 0.044150 0.209757 0.172122 0.088370 0.179069 0.263707 -0.394223 -0.359401 -0.402970 -0.349876 -0.209196 -0.250873 -0.211533 -0.317802 -0.112364 -0.551458 0.266304 0.281544 0.252223 0.261787 0.233660 0.235142 0.235255 0.227679 0.227334 0.272219 0.225762 0.211305
chargesum: 0.00000
title: Mulliken charges with hydrogens summed into heavy atoms:
elementType: O O O C C C C C C C C C C C C C C C C
charge: -0.274088 -0.235580 -0.218024 0.044150 0.209757 0.172122 0.088370 0.179069 0.263707 -0.127919 -0.077857 -0.150747 -0.088089 0.024464 -0.015732 0.023722 0.137212 0.159855 -0.114391
polarizability: 2.90223106e+02 -1.04965367e+01 2.11647650e+02 -1.15213892e-01 -6.87836978e-02 7.32238644e+01
1716.lowfreq: -84.0266 -6.9234 -2.4735 -1.5282 -0.0007 -0.0006 -0.0004 30.5211 59.4329
frequency: -84.0258 30.4863 59.4247 71.4752 83.4677 118.6459 137.0310 199.7469 215.6264 254.3661 270.1508 286.2743 301.5080 338.9942 372.5665 426.0687 433.5903 491.6694 499.0361 515.5484 521.4262 562.1829 581.1508 604.3743 605.9835 638.8037 665.1318 674.1215 720.9018 768.5615 769.1122 781.8598 815.5914 831.7653 861.9519 881.3945 887.3225 902.7221 935.7584 948.5419 967.9338 972.4928 988.0253 1000.6285 1017.8499 1022.8920 1044.9334 1081.7530 1095.3936 1139.0455 1154.0427 1164.5789 1184.3335 1185.9570 1201.7296 1222.3544 1247.8611 1256.1713 1277.7446 1301.4385 1332.7494 1388.1927 1401.9391 1421.9275 1429.3577 1446.7581 1446.8305 1462.7976 1469.8646 1552.1166 1574.7917 1598.5299 1605.4957 1625.4076 1664.2728 2945.4933 3003.8367 3091.6547 3135.7774 3138.6375 3146.5727 3152.1825 3165.2941 3175.5122 3176.7099 3185.4855 3203.4519
redmass: 2.0094 6.7376 5.2012 4.5721 5.6902 2.3160 3.7691 4.4618 4.4871 5.6612 5.3429 7.7311 4.4382 7.0205 5.7999 3.5110 5.4161 3.8334 6.3227 6.5495 3.7282 1.3609 7.7187 4.7697 7.8988 6.4808 3.5249 6.8016 2.6456 1.4987 6.8334 1.5992 4.2871 6.8612 1.4336 1.4994 2.8705 6.5358 1.3134 2.6590 1.3200 1.3639 1.1754 1.3301 1.4703 2.2324 4.5463 2.1860 2.1818 2.1368 1.9779 1.2129 1.0613 1.2001 2.2550 3.4443 2.5230 1.9751 1.3363 2.6121 1.4314 7.9343 10.5752 2.7874 1.2154 1.8043 2.6352 2.5546 1.4579 9.1270 6.8576 7.1951 7.8524 7.4722 4.9083 1.0548 1.1062 1.0624 1.0943 1.0860 1.0880 1.0899 1.0952 1.1002 1.0917 1.0980 1.1132
irintensity: 3.3243 4.1583 1.7656 0.4058 2.0745 0.8131 0.4609 1.1074 0.0210 4.3203 0.0264 0.6364 0.8641 5.4414 3.5573 0.5968 0.3983 3.2618 0.3210 0.5098 2.6888 22.3435 4.6887 0.1156 12.2420 2.7703 19.3809 5.9810 9.8773 29.1923 1.7968 132.9024 6.2597 6.8688 1.8500 0.7308 2.9378 31.6426 78.0354 2.6746 1.8236 3.1023 15.5261 0.3454 14.2334 9.8751 233.1036 10.7303 17.2066 13.3087 13.3582 0.1475 0.7966 0.7433 8.9075 72.7308 190.5186 16.4953 37.0405 186.3241 17.9278 14.2802 7.1616 48.7309 53.1957 212.0552 49.5825 8.9085 52.0178 115.7349 85.2441 165.1915 216.6815 10.0724 11.3588 29.5932 31.6781 10.5007 1.6809 4.3050 10.8725 5.3302 10.8583 21.9193 9.1448 8.2516 18.4529
temp: 298.150 k
press: 1.00000 atm
elementType: 8 8 8 6 6 6 6 6 6 6 6 6 6 6 6 6 6 6 6 1 1 1 1 1 1 1 1 1 1 1 1
symmnumber: 1
zpe: 613284.3 jmol-1
zpe.correction: 0.233588 hartree
zpe.thermalcorrener: 0.248536 hartree
zpe.thermalcorrenthalpy: 0.249480 hartree
zpe.thermalcorrgfe: 0.190658 hartree
zpe.sumelectzpe: -841.225716 hartree
zpe.sumelectthermal: -841.210768 hartree
zpe.sumelectthermalent: -841.209824 hartree
zpe.sumelectthermalfe: -841.268645 hartree
dipole: -0.3663 2.9093 -0.0060
dipole: 2.9322
quadrupole: -80.4728 -102.4499 -115.3480
quadrupole: -8.4429 -0.0161 0.0326
quadrupole: 18.9508 -3.0264 -15.9244 -8.4429 -0.0161 0.0326
hfenergy: -841.4593036 hartree
pointgroup: C01 [X(C16H12O3)]
dipole: 0.2522776 1.1235509 -0.0696472 debye
polarizability: 290.1648121|2.0312848|210.061362|-17.1492444|-6.4490447|74.8684467 unknown
InChI: InChI=1S/C16H12O3/c1-2-10-18-13-8-5-9-14-15(13)16(17)11-6-3-4-7-12(11)19-14/h2-9H,1,10H2
charge 0 multiplicity 1
31 atoms
O  -1.910368 1.711898 -0.041997
O  2.319049 -0.727273 -0.26622
O  -0.021231 -2.04355 -0.0261
C  0.196206 0.394638 -0.150723
C  -0.511405 1.635478 -0.150666
C  -2.035258 -0.741686 0.076568
C  -0.552211 -0.888478 -0.033856
C  -2.658597 0.529571 0.070131
C  1.631825 0.476611 -0.268347
C  0.124567 2.89017 -0.258789
C  -2.862111 -1.890719 0.192328
C  2.28017 1.730245 -0.378218
C  -4.057939 0.680809 0.175041
C  1.522472 2.923444 -0.372566
C  -4.257107 -1.763936 0.297822
C  -4.85449 -0.47329 0.289095
C  3.79231 -0.707324 -0.381933
C  4.222612 -2.157911 -0.340246
C  5.506666 -2.581141 -0.416732
H  -0.48511 3.796735 -0.25157
H  -2.365357 -2.866438 0.195507
H  3.367094 1.789133 -0.467999
H  -4.490345 1.685467 0.165138
H  2.036959 3.886183 -0.458391
H  -4.886103 -2.655457 0.386634
H  -5.942036 -0.372264 0.371111
H  4.08458 -0.219289 -1.335035
H  4.224639 -0.126942 0.459661
H  3.391859 -2.867743 -0.239698
H  5.750212 -3.647559 -0.380203
H  6.350945 -1.886987 -0.517544
