program: Gaussian 09
title: 000187849
version: EM64L-G09RevD.01
frameworkgroup: C1[X(C11H20F3NO3Si)]
method: RPBEPBE
basis: SDD
operation: Freq
keyword: #p
keyword: freq=noraman
keyword: PBEPBE/SDD
title: #p freq=noraman PBEPBE/SDD
converged: YES YES NO NO
title: Mulliken charges:
elementType: Si F F F O O O N C C C C C C C C C C C H H H H H H H H H H H H H H H H H H H H
charge: 1.375639 -0.142742 -0.172842 -0.140073 -0.539714 -0.268331 -0.226932 -0.369309 -0.419708 -0.143249 -0.009112 0.230040 -0.733181 -0.708171 -1.032496 -1.034225 -1.026479 0.162677 0.297153 0.210785 0.229605 0.284258 0.191743 0.209141 0.253169 0.215350 0.242923 0.213928 0.206165 0.363780 0.241174 0.277416 0.249693 0.278141 0.242158 0.245116 0.238349 0.256390 0.251773
chargesum: 0.00000
title: Mulliken charges with hydrogens summed into heavy atoms:
elementType: Si F F F O O O N C C C C C C C C C C C
charge: 1.375639 -0.142742 -0.172842 -0.140073 -0.539714 -0.268331 -0.226932 -0.005529 0.020681 0.141009 0.182631 0.230040 -0.055522 -0.045155 -0.264214 -0.268811 -0.279966 0.162677 0.297153
polarizability: 1.83186662e+02 -1.58976966e+00 1.56911637e+02 2.70118278e+00 -5.07458553e+00 1.41646170e+02
1716.lowfreq: -8.4689 -0.0010 -0.0006 0.0007 2.3623 7.6729 16.2705 21.7317 33.3088
frequency: 16.0591 21.6811 33.2356 36.7960 39.3757 61.1759 78.0358 84.9963 106.9079 110.3889 119.7075 129.8382 134.5565 136.4584 151.4329 174.5434 190.6466 201.1476 232.4468 235.1204 243.7657 250.7619 255.3084 267.1633 280.5445 306.8414 347.5016 366.6029 374.5933 384.8163 432.8031 451.6750 520.4680 531.5408 590.6714 630.7697 647.1034 666.5637 674.5126 703.5852 712.9145 713.6549 718.5085 757.7872 794.4159 807.9665 819.5209 831.0774 847.3168 919.5241 919.8391 922.8133 926.2647 941.2733 950.0291 970.5112 1002.4766 1018.9178 1031.6348 1051.6289 1115.7892 1122.6060 1151.8975 1195.3624 1203.4582 1235.6413 1249.2332 1282.5132 1305.7613 1308.6729 1309.4708 1320.0780 1326.5810 1346.7572 1355.5651 1380.8101 1400.0655 1433.3170 1444.6627 1445.7345 1446.2360 1450.9117 1451.8739 1463.4726 1464.4912 1481.5419 1489.8842 1500.9351 1503.3459 1591.2970 1648.3925 2950.3866 2971.8160 2979.9839 2984.6968 2988.4824 2989.7124 2991.9971 3039.9751 3061.0304 3065.5423 3068.9743 3074.7406 3087.9375 3088.9144 3094.2354 3098.0597 3101.3893 3106.4124 3107.7933 3477.9426
redmass: 11.3233 3.6212 5.2836 5.4115 3.7350 3.6670 4.8145 6.2155 3.2885 1.0495 4.2555 1.0596 3.0949 1.0807 3.7087 3.2672 2.8830 3.3362 3.2353 4.8107 1.4518 3.4982 2.4689 1.3716 5.6296 7.0790 2.6199 2.2639 7.0348 4.0201 5.5813 7.2223 6.8456 2.9887 4.3684 9.4974 5.9760 4.2346 2.0382 3.2250 5.3818 3.0394 2.8413 1.1720 3.7641 2.4924 1.4327 2.1981 1.8726 1.2843 1.4721 1.5648 1.7664 2.7592 1.5833 2.0005 2.5991 6.6234 12.4044 3.7385 1.9743 2.3928 4.1602 1.9968 1.9858 1.3898 2.1296 1.6272 1.2036 1.2146 1.4359 1.1909 1.7444 1.4436 1.3074 1.2115 1.2093 1.0520 1.0496 1.0540 1.0505 1.0631 1.0777 1.0446 1.0483 1.0490 1.0526 1.6540 1.1435 8.9959 10.8522 1.0805 1.0361 1.0492 1.0499 1.0350 1.0351 1.0349 1.0988 1.0874 1.0989 1.0988 1.0999 1.0974 1.0973 1.0976 1.0977 1.0986 1.0990 1.0987 1.0772
irintensity: 0.1449 0.1144 0.2364 0.9861 0.4900 1.1566 3.5825 1.4592 1.6858 0.0195 1.6067 0.0727 0.2430 0.0764 0.7931 1.0855 2.8735 3.3724 4.7426 8.2364 5.2018 30.9289 3.2048 4.7558 2.5945 9.0120 3.1648 1.0873 4.4272 6.8873 11.3964 2.1037 1.6926 5.7365 3.4523 53.2058 19.3190 98.3070 40.9011 20.2247 27.8878 26.6417 7.6817 0.0634 21.2348 10.8904 17.7561 51.2744 18.5422 60.1609 107.5843 105.2213 172.8892 84.8986 3.9151 3.4297 27.3924 133.0508 246.7984 28.8673 14.1314 13.7231 219.4336 163.3629 16.3253 7.8485 216.6667 109.5270 56.3647 61.0266 4.1317 19.8874 29.6646 26.1872 9.0715 22.9211 18.4210 0.0247 18.2143 3.8766 3.9072 4.7610 12.9403 3.4963 29.6018 22.7420 4.6054 140.8697 18.2924 165.8925 227.1639 22.2453 36.0591 34.9608 28.2786 8.4807 5.5438 7.9568 11.1815 8.1430 27.7442 53.3236 30.1351 5.1835 11.3011 20.1342 28.9133 10.4257 4.1943 6.6818 88.1217
temp: 298.150 k
press: 1.00000 atm
elementType: 14 9 9 9 8 8 8 7 6 6 6 6 6 6 6 6 6 6 6 1 1 1 1 1 1 1 1 1 1 1 1 1 1 1 1 1 1 1 1
symmnumber: 1
zpe: 793343.0 jmol-1
zpe.correction: 0.302168 hartree
zpe.thermalcorrener: 0.326743 hartree
zpe.thermalcorrenthalpy: 0.327687 hartree
zpe.thermalcorrgfe: 0.244915 hartree
zpe.sumelectzpe: -1299.076404 hartree
zpe.sumelectthermal: -1299.051830 hartree
zpe.sumelectthermalent: -1299.050886 hartree
zpe.sumelectthermalfe: -1299.133658 hartree
dipole: 6.7321 1.9363 1.4985
dipole: 7.1635
quadrupole: -117.5204 -121.4893 -125.0847
quadrupole: -6.0992 -6.9487 3.9456
quadrupole: 3.8444 -0.1245 -3.7199 -6.0992 -6.9487 3.9456
hfenergy: -1299.3785725 hartree
pointgroup: C01 [X(C11H20F3N1O3Si1)]
dipole: 2.6687689 -0.8486717 -0.3170668 debye
polarizability: 183.3509234|1.4998563|154.3807514|-1.2793435|-7.5818153|144.012795 unknown
InChI: InChI=1S/C11H20F3NO3Si/c1-7(2)6-8(9(16)18-19(3,4)5)15-10(17)11(12,13)14/h7-8,15H,6H2,1-5H3
charge 0 multiplicity 1
39 atoms
Si 3.986543 0.500014 0.148728
F  -4.562737 0.794449 -0.593077
F  -2.904706 1.844292 -1.737786
F  -3.552172 2.617756 0.297652
O  2.303579 -0.158969 0.372759
O  1.244457 1.073041 -1.2860
O  -2.5409 0.107666 1.445423
N  -1.196905 0.231773 -0.478546
C  0.048572 -2.001565 -0.488408
C  -0.057325 -0.536957 0.049399
C  -0.968813 -3.047529 0.054113
C  1.216817 0.222465 -0.354998
C  -0.970716 -3.12157 1.600263
C  -2.406417 -2.880378 -0.49574
C  3.911582 2.362532 0.502492
C  4.517925 0.089258 -1.626389
C  4.926811 -0.483457 1.466429
C  -2.29547 0.521204 0.278551
C  -3.324543 1.44197 -0.435956
H  -0.005803 -1.971451 -1.595359
H  1.066452 -2.345213 -0.219131
H  -0.134066 -0.55792 1.150102
H  -0.587676 -4.019654 -0.327819
H  0.054382 -3.226369 2.004252
H  -1.433649 -2.219831 2.041039
H  -1.558783 -3.992835 1.942794
H  -2.920994 -2.020738 -0.035192
H  -3.007452 -3.779337 -0.264569
H  -2.409883 -2.745985 -1.593676
H  -1.040912 0.712693 -1.373367
H  4.918676 2.814106 0.431233
H  3.25343 2.86718 -0.225412
H  3.523609 2.558101 1.517967
H  3.848128 0.585941 -2.34915
H  5.551614 0.433745 -1.816016
H  4.485186 -0.999591 -1.809803
H  5.994114 -0.196702 1.489634
H  4.501837 -0.300492 2.469032
H  4.868702 -1.567545 1.264432
