program: Gaussian 09
title: 000187809
version: EM64L-G09RevD.01
frameworkgroup: C1[X(C15H20O2)]
method: RPBEPBE
basis: SDD
operation: Freq
keyword: #pfreq=noraman
keyword: PBEPBE/SDD
title: #p freq=noraman PBEPBE/SDD
converged: YES YES NO NO
title: Mulliken charges:
elementType: O O C C C C C C C C C C C C C C C H H H H H H H H H H H H H H H H H H H H
charge: -0.216563 -0.210014 0.260390 0.375509 -0.352816 -0.488363 -0.274932 -0.460402 -0.470881 0.158576 -0.460525 -0.778875 -0.532788 0.382268 0.078683 -0.843399 -0.720784 0.252087 0.203600 0.216286 0.258698 0.206286 0.195576 0.233831 0.219041 0.213927 0.210779 0.225164 0.208965 0.251885 0.228252 0.221428 0.259112 0.233621 0.224627 0.233314 0.258440
chargesum: 0.00000
title: Mulliken charges with hydrogens summed into heavy atoms:
elementType: O O C C C C C C C C C C C C C C C
charge: -0.216563 -0.210014 0.260390 0.375509 -0.100729 -0.068477 -0.016234 -0.058541 -0.018009 0.158576 -0.035820 -0.092861 -0.083108 0.382268 0.078683 -0.126039 -0.229030
polarizability: 2.13444946e+02 -1.19368419e+01 1.48044232e+02 -1.69457447e+00 2.25349892e+00 1.30575507e+02
1716.lowfreq: -12.9178 -2.8046 -0.0008 -0.0007 -0.0006 11.2772 48.4491 60.3106 82.2035
frequency: 48.2501 60.2563 82.1750 103.6368 123.3491 136.8951 176.3756 198.2968 234.0040 244.6615 253.6264 294.9073 306.7732 311.3906 337.8382 372.4197 399.2799 417.8912 437.3007 449.0589 479.7633 511.8015 544.5433 569.4085 603.9465 647.4997 664.3540 688.3365 700.9997 758.7671 787.3175 796.0348 808.0696 837.8111 847.0858 866.4193 887.1202 920.8805 931.4633 949.4256 969.7846 983.9699 987.0516 996.0058 1010.9992 1036.9989 1042.5908 1050.4604 1081.8914 1092.8815 1127.8281 1144.3318 1165.4407 1173.2971 1182.4467 1196.9873 1210.9681 1216.2312 1231.3377 1257.3290 1262.9758 1279.2593 1310.1981 1317.2500 1331.5632 1332.4542 1342.2736 1345.8263 1355.3928 1363.4000 1384.7480 1392.6733 1421.2879 1446.5792 1451.3700 1460.9598 1467.2109 1472.1923 1478.9502 1481.5012 1482.4167 1501.5933 1653.3002 1672.7344 1678.8455 2939.8219 2957.6646 2964.5346 2974.8619 2977.7614 2987.9439 2997.1309 3001.0110 3016.3703 3020.0400 3026.0925 3035.0236 3049.7904 3056.1044 3056.8197 3075.1375 3079.4247 3095.7495 3096.8981 3204.7803
redmass: 3.3250 3.5442 1.1242 4.3829 3.1374 2.7804 2.2167 1.6507 3.4475 2.2662 2.9873 2.9006 2.5335 2.5292 2.3505 2.8133 2.6455 3.1769 2.9505 3.9568 3.0364 3.7153 3.7471 2.5428 5.3775 2.6917 2.6457 3.2101 3.1975 3.7809 2.4313 2.6691 2.7355 2.7411 1.9772 1.9700 2.2390 1.9865 2.0091 1.9016 1.9071 1.4351 1.5726 1.4915 1.7908 1.8171 2.7704 2.7744 1.7203 2.0829 2.2575 1.5304 1.9735 1.6250 2.2724 1.8037 2.0191 1.7442 1.9104 2.1477 1.3252 1.2337 1.4330 1.8836 1.4148 1.4988 1.5991 1.3866 1.6375 1.5611 1.2023 1.1816 1.1732 1.0927 1.0823 1.0732 1.0714 1.0844 1.0805 1.0654 1.0518 1.0630 7.8517 10.3421 7.1804 1.0645 1.0609 1.0599 1.0379 1.0398 1.0788 1.0642 1.0779 1.0861 1.0971 1.0975 1.0868 1.1025 1.0970 1.1010 1.0955 1.0986 1.0616 1.0976 1.1154
irintensity: 2.5748 1.2723 1.1672 0.9870 0.1699 1.2115 1.1391 1.3955 1.0894 0.6425 0.5091 2.7438 0.3778 2.8021 0.5154 3.2578 4.1553 0.0759 0.6360 1.2786 0.8446 2.7019 4.7593 1.4066 11.2604 4.6833 5.2959 5.9956 8.2799 4.5519 7.9168 9.5566 48.7005 45.7199 36.0533 18.2539 2.1604 4.0179 9.5097 6.2304 1.4684 38.5516 33.5341 6.5012 26.7410 8.8477 120.2903 110.6512 2.4745 17.6193 1.0407 10.7642 3.8841 1.8378 2.9869 0.6923 10.6918 11.0808 33.3831 60.4984 2.5477 5.6326 0.3749 5.0086 2.6846 1.3150 1.8114 0.2287 3.7928 14.6780 18.2430 8.5537 19.3751 11.8892 3.4786 4.6583 1.3043 12.7839 26.4359 7.2158 13.8966 13.1043 43.3660 197.7604 62.9499 36.2871 8.4973 66.0330 30.7580 25.4611 15.0353 28.6091 41.0643 3.2581 18.2694 90.0509 15.8174 45.9513 16.3566 54.0236 30.9742 25.8763 5.3805 21.7865 3.4079
temp: 298.150 k
press: 1.00000 atm
elementType: 8 8 6 6 6 6 6 6 6 6 6 6 6 6 6 6 6 1 1 1 1 1 1 1 1 1 1 1 1 1 1 1 1 1 1 1 1
symmnumber: 1
zpe: 826907.8 jmol-1
zpe.correction: 0.314953 hartree
zpe.thermalcorrener: 0.330933 hartree
zpe.thermalcorrenthalpy: 0.331877 hartree
zpe.thermalcorrgfe: 0.272537 hartree
zpe.sumelectzpe: -732.738728 hartree
zpe.sumelectthermal: -732.722748 hartree
zpe.sumelectthermalent: -732.721804 hartree
zpe.sumelectthermalfe: -732.781144 hartree
dipole: -3.1794 -1.7641 -4.3833
dipole: 5.6950
quadrupole: -104.3545 -100.1751 -106.0865
quadrupole: -8.1149 -12.2318 -4.4225
quadrupole: -0.8158 3.3636 -2.5478 -8.1149 -12.2318 -4.4225
hfenergy: -733.0536805 hartree
pointgroup: C01 [X(C15H20O2)]
dipole: -1.2815258 -0.7507793 -1.677593 debye
polarizability: 213.3394195|-12.052419|148.213023|-2.7341776|1.8644232|130.5122432 unknown
InChI: InChI=1S/C15H20O2/c1-9-5-4-7-15(3)8-6-11-10(2)14(16)17-13(11)12(9)15/h11,13H,2,4-8H2,1,3H3
charge 0 multiplicity 1
37 atoms
O  1.223637 1.033127 0.848978
O  3.446797 1.081115 1.554921
C  -1.31419 -1.089974 0.261087
C  -0.949189 0.334468 -0.199684
C  0.506923 0.638154 -0.457543
C  -0.502183 -2.121794 -0.585084
C  1.40807 -0.492525 -1.036419
C  -2.827316 -1.365184 0.028119
C  1.018559 -1.900398 -0.503767
C  -1.882894 1.32205 -0.392362
C  -3.717864 -0.222895 0.551267
C  -0.975951 -1.269059 1.773911
C  -3.372687 1.097817 -0.166109
C  2.783844 -0.083826 -0.54201
C  2.597862 0.722965 0.716068
C  -1.525645 2.734165 -0.856121
C  4.008794 -0.368639 -1.046204
H  0.60828 1.533125 -1.095636
H  -0.827799 -2.050895 -1.644002
H  -0.752593 -3.143798 -0.237716
H  1.336174 -0.490253 -2.139319
H  -3.097525 -2.322235 0.516719
H  -3.008476 -1.49432 -1.059248
H  1.362412 -2.014056 0.540944
H  1.558672 -2.663557 -1.095395
H  -3.570091 -0.101338 1.640849
H  -4.787013 -0.46627 0.403169
H  -1.638719 -0.647272 2.40029
H  -1.106467 -2.327303 2.073455
H  0.055687 -0.95942 2.007894
H  -3.77793 1.958142 0.404635
H  -3.879106 1.140393 -1.155844
H  -0.831074 3.231197 -0.154365
H  -2.433285 3.358555 -0.923938
H  -1.05055 2.745339 -1.855765
H  4.140703 -0.954146 -1.962928
H  4.908137 -0.009155 -0.533047
