program: Gaussian 09
title: 000185225
version: EM64L-G09RevD.01
frameworkgroup: C1[X(C17H27NOS)]
method: RPBEPBE
basis: SDD
operation: Freq
keyword: #p
keyword: freq=noraman
keyword: PBEPBE/SDD
title: #p freq=noraman PBEPBE/SDD
converged: YES YES NO NO
title: Mulliken charges:
elementType: S O N C C C C C C C C C C C C C C C C C H H H H H H H H H H H H H H H H H H H H H H H H H H H
charge: -0.066878 -0.279561 -0.038548 -0.329869 -0.435184 -0.372134 -0.574332 -0.352446 0.087568 0.504599 -0.163934 -0.372786 -0.660098 -0.697472 -0.424857 -0.403092 -0.688732 -0.226975 -0.231504 -0.244397 0.235962 0.186562 0.264191 0.212269 0.205573 0.220658 0.213784 0.205773 0.247435 0.209966 0.227894 0.204731 0.194800 0.216324 0.216586 0.241258 0.211645 0.250107 0.212395 0.229720 0.234414 0.215030 0.213769 0.228407 0.221913 0.223123 0.226341
chargesum: 0.00000
title: Mulliken charges with hydrogens summed into heavy atoms:
elementType: S O N C C C C C C C C C C C C C C C C C
charge: -0.066878 -0.279561 -0.038548 0.092656 0.041276 0.054097 -0.154775 0.104955 0.315462 0.504599 -0.163934 0.026745 0.014071 -0.023324 -0.195136 -0.168677 -0.031527 -0.005063 -0.008382 -0.018057
polarizability: 2.74188447e+02 -8.38871359e+00 2.07950830e+02 1.93337726e+01 1.83080641e+01 1.53111941e+02
1716.lowfreq: -0.0014 -0.0004 0.0015 1.9469 5.5320 13.5851 18.5619 21.8305 22.8594
frequency: 17.7312 21.8231 22.8119 39.7201 45.6200 57.4190 73.4510 77.8273 89.7473 102.8160 105.8660 130.9079 144.8130 180.4822 190.3643 201.9611 211.7698 214.4491 238.1636 293.4284 322.0615 331.1306 338.7976 353.6101 380.6613 396.7798 403.8456 426.3621 478.1417 501.3399 524.7422 538.8667 583.2390 617.0339 617.7431 649.0338 705.8838 739.8439 758.0163 770.7333 780.8010 789.0776 808.9669 816.7670 853.3469 856.6197 888.7872 915.0300 919.3862 965.2688 975.7485 987.9947 989.9495 992.8207 999.1468 1018.4126 1027.7403 1038.5573 1047.6292 1053.1185 1065.3874 1079.0144 1092.5991 1097.7802 1110.2324 1122.8041 1131.1126 1165.4992 1171.3007 1183.1714 1187.4118 1217.1819 1224.4036 1240.2014 1254.5759 1263.1169 1284.6162 1291.4675 1296.7957 1307.0759 1313.8540 1328.5071 1331.5661 1345.7144 1350.7627 1359.0175 1368.9108 1382.2913 1383.5339 1384.1244 1391.5126 1429.6521 1439.8962 1451.1448 1456.4687 1464.1223 1466.3931 1468.5396 1471.7224 1474.7624 1478.0083 1480.7769 1484.1187 1486.6141 1487.9885 1499.6064 1592.7534 1614.5517 2967.0427 2971.1413 2980.8170 2982.3144 2984.6991 2986.7426 2987.1814 2991.0788 3007.8846 3011.0411 3012.4665 3033.2542 3038.5067 3049.6910 3068.5710 3075.4217 3078.5230 3083.6547 3088.7321 3090.1425 3097.3917 3105.5822 3113.0033 3114.9141 3130.3431 3142.0805 3160.9371
redmass: 4.6289 3.7294 4.3049 3.4102 3.8393 4.2808 2.9686 3.5904 4.8510 2.2777 1.9351 1.9711 2.4554 3.4063 3.8681 2.6255 1.0399 1.2019 1.4110 3.4910 3.4050 3.5241 2.5222 2.9957 2.9149 2.5321 2.8205 3.8246 2.9435 3.3480 3.8516 3.6547 4.6675 7.5126 6.3573 3.6675 1.7293 1.0852 1.9282 1.4312 1.2491 1.2659 3.5866 2.0994 1.3089 1.8909 2.1635 1.5218 1.5557 1.3230 1.3869 1.7689 5.0263 1.3291 2.3219 3.2725 2.2260 3.3070 1.8265 3.4308 2.6217 2.0413 1.6985 2.9844 1.4315 2.6193 2.1463 1.8529 1.0557 1.8852 1.1220 2.3009 2.4873 1.3034 1.3918 1.2453 1.2132 1.1691 1.2819 1.3946 1.3024 1.2491 1.2535 1.3853 1.3249 1.6320 1.3359 7.7764 1.2278 1.2136 1.2131 1.5993 2.1784 1.0734 1.1315 1.0604 1.0775 1.0484 1.1195 1.0442 1.0449 1.0682 2.2127 1.0664 1.0980 1.5498 6.0305 6.1653 1.0597 1.0614 1.0598 1.0494 1.0387 1.0362 1.0446 1.0625 1.0845 1.0655 1.0961 1.0992 1.0997 1.1030 1.1041 1.0993 1.0999 1.0988 1.0997 1.0972 1.1006 1.1021 1.0866 1.0869 1.0908 1.0958 1.1015
irintensity: 0.3020 0.0423 0.4258 0.2892 0.9141 1.5124 0.0547 0.0161 0.1025 0.3104 0.5678 0.3517 3.8426 3.4861 0.3940 1.5667 0.1203 0.0096 0.2918 3.7822 1.8026 1.5685 1.2723 2.5255 1.5659 4.3259 0.0026 4.2443 1.7354 7.8407 2.0461 12.1005 4.6150 11.5298 0.0888 3.3252 53.7926 7.6047 43.9301 3.1910 3.0568 11.0228 2.0534 13.7781 1.2579 13.7465 30.3021 6.5084 7.8494 8.8850 0.0179 23.7063 3.0177 5.6992 37.0117 0.7213 6.8712 10.8204 12.1750 1.6199 4.1086 21.5781 19.2073 220.9414 14.3171 94.3620 14.4865 110.0156 1.3464 8.3543 0.2425 0.5255 111.4967 8.8527 48.5902 2.1887 34.5339 36.6731 0.5428 22.9982 14.3370 0.3069 0.6106 1.6430 6.3775 4.6487 11.9616 0.1143 26.1785 6.1167 28.7933 111.4016 6.4958 3.4838 30.3212 12.6549 1.7673 3.9425 3.9984 2.8266 10.3599 5.4004 18.8826 19.0709 21.4945 157.6472 1.4171 12.4325 4.6218 8.8038 54.6791 21.4648 29.6405 29.9128 40.1946 52.4828 6.9470 37.9509 2.7480 2.6834 14.6841 33.3672 29.5094 12.3364 39.2142 20.2026 78.7972 31.8123 18.9319 32.4644 9.4499 7.3537 12.1242 47.1022 25.7217
temp: 298.150 k
press: 1.00000 atm
elementType: 16 8 7 6 6 6 6 6 6 6 6 6 6 6 6 6 6 6 6 6 1 1 1 1 1 1 1 1 1 1 1 1 1 1 1 1 1 1 1 1 1 1 1 1 1 1 1
symmnumber: 1
zpe: 1064377.5 jmol-1
zpe.correction: 0.405400 hartree
zpe.thermalcorrener: 0.428432 hartree
zpe.thermalcorrenthalpy: 0.429376 hartree
zpe.thermalcorrgfe: 0.349209 hartree
zpe.sumelectzpe: -1190.497119 hartree
zpe.sumelectthermal: -1190.474087 hartree
zpe.sumelectthermalent: -1190.473143 hartree
zpe.sumelectthermalfe: -1190.553311 hartree
dipole: 1.2411 3.1285 1.4880
dipole: 3.6799
quadrupole: -118.2023 -125.9578 -132.7358
quadrupole: 0.1732 6.4861 1.1644
quadrupole: 7.4297 -0.3258 -7.1039 0.1732 6.4861 1.1644
hfenergy: -1190.9025195 hartree
pointgroup: C01 [X(C17H27N1O1S1)]
dipole: 0.4979658 -1.2160043 -0.6078339 debye
polarizability: 273.3349475|9.8899842|207.7604891|-21.215243|18.5553719|154.1557811 unknown
InChI: InChI=1S/C17H27NOS/c1-4-15(3)19-17(20)18(5-2)14-10-9-13-16-11-7-6-8-12-16/h6-8,11-12,15H,4-5,9-10,13-14H2,1-3H3
charge 0 multiplicity 1
47 atoms
S  2.137515 1.815037 0.803859
O  3.962837 0.091869 -0.352967
N  1.908599 -0.810897 0.019066
C  -0.50656 -0.33468 -0.524876
C  0.515639 -0.826413 0.524496
C  -1.94559 -0.337843 0.033844
C  -2.986499 0.174574 -1.000395
C  2.421591 -2.061929 -0.60018
C  4.942582 1.230688 -0.428336
C  -4.399722 0.20727 -0.436742
C  2.677434 0.320191 0.134225
C  6.330368 0.589937 -0.271611
C  3.075229 -3.009308 0.428572
C  4.737258 1.963451 -1.760011
C  -5.303156 -0.863737 -0.659519
C  -4.831402 1.296642 0.364867
C  6.557635 -0.058547 1.109333
C  -6.600098 -0.850653 -0.096518
C  -6.126192 1.315685 0.92948
C  -7.01624 0.239844 0.70156
H  -0.223462 0.692122 -0.825941
H  -0.452138 -0.972575 -1.431115
H  0.463388 -0.17833 1.417094
H  0.282839 -1.864425 0.831526
H  -2.230562 -1.360003 0.357072
H  -1.991886 0.301659 0.93799
H  -2.682156 1.188877 -1.32614
H  -2.948578 -0.475359 -1.896631
H  3.15031 -1.792838 -1.380663
H  1.562631 -2.557923 -1.089739
H  4.711363 1.903699 0.420026
H  6.472206 -0.159185 -1.075366
H  7.081046 1.386773 -0.443316
H  3.391934 -3.947671 -0.062837
H  2.371393 -3.267845 1.240384
H  3.964306 -2.534425 0.877088
H  4.918863 1.286153 -2.61393
H  3.710269 2.360999 -1.824952
H  5.439363 2.814351 -1.833767
H  -4.988852 -1.710837 -1.282645
H  -4.147855 2.136936 0.541552
H  6.454304 0.685533 1.920838
H  7.567824 -0.501034 1.179452
H  5.81859 -0.858794 1.289989
H  -7.28537 -1.685644 -0.28325
H  -6.442768 2.167829 1.541981
H  -8.022032 0.253776 1.136453
