program: Gaussian 09
title: 000187790
version: EM64L-G09RevD.01
frameworkgroup: C1[X(C10H13N5O4)]
method: RPBEPBE
basis: SDD
operation: Freq
keyword: #p
keyword: freq=noraman
keyword: PBEPBE/SDD
title: #p freq=noraman PBEPBE/SDD
converged: YES YES NO NO
title: Mulliken charges:
elementType: O O O O N N N N N C C C C C C C C C C H H H H H H H H H H H H H
charge: -0.258358 -0.426860 -0.430398 -0.208242 -0.223048 -0.440176 -0.024672 -0.054979 -0.627597 -0.093768 -0.530224 -0.119553 -0.157066 -0.359048 0.351376 -0.219886 -0.139852 0.016722 0.165819 0.272394 0.253958 0.256625 0.285736 0.272651 0.223738 0.241888 0.287475 0.351932 0.320541 0.348447 0.358154 0.306272
chargesum: 0.00000
title: Mulliken charges with hydrogens summed into heavy atoms:
elementType: O O O O N N N N N C C C C C C C C C C
charge: -0.258358 -0.074928 -0.081951 -0.208242 -0.223048 -0.119635 -0.024672 -0.054979 0.036829 0.178626 -0.019642 0.166183 0.115585 0.106578 0.351376 0.067588 -0.139852 0.016722 0.165819
polarizability: 1.95608614e+02 2.28650094e+00 1.66868715e+02 -1.41329955e+01 6.39992677e+00 9.89527933e+01
1716.lowfreq: -7.0865 -5.0031 0.0007 0.0008 0.0009 3.8959 12.1843 34.4344 48.5341
frequency: 9.0426 34.3400 48.4725 70.0043 86.6694 107.0600 114.8459 130.9250 179.6904 191.7489 205.2975 232.3607 262.7382 290.3181 303.5286 317.3910 331.8939 372.3703 381.7317 410.4308 437.8048 446.5965 471.7069 495.4367 527.0449 530.2509 610.0112 636.3555 643.1562 647.1192 681.1570 687.0382 715.0232 747.5137 762.8320 789.9635 811.8291 816.8843 868.9681 887.0492 912.7410 934.3434 960.9288 968.6129 980.5393 991.2061 1026.8157 1044.9244 1057.2157 1073.1990 1139.5928 1141.1618 1154.6803 1164.3392 1184.1277 1226.5730 1251.1930 1255.2431 1262.8844 1287.6609 1297.3600 1310.4710 1323.6275 1325.2237 1346.9384 1348.7310 1372.1535 1381.1795 1383.4809 1422.1515 1460.3197 1474.8563 1522.8141 1526.6117 1598.3108 1619.1182 1650.0656 2999.5657 3014.8015 3025.1994 3055.3522 3090.5362 3096.8158 3111.4590 3265.2538 3533.6363 3544.0310 3553.8014 3573.9991 3705.1378
redmass: 3.0963 7.1617 2.5574 6.2062 3.8090 3.3504 4.5522 3.4668 4.0185 4.5513 4.2787 2.3687 6.3265 1.2625 5.5351 7.9248 5.1234 4.7185 1.1355 5.5884 1.7255 1.8957 5.5859 2.9148 1.1797 7.1835 4.2787 6.3167 5.4722 10.5866 3.9511 7.3879 7.1364 3.9320 3.2319 1.9180 5.0775 3.3590 3.4875 3.2552 2.8846 5.2945 3.0441 2.3613 3.9302 3.9129 4.0262 2.1737 2.4717 1.6508 2.2884 1.7048 2.0268 1.7154 2.2963 1.5924 1.8959 1.5755 1.3543 1.6376 1.9491 1.4323 1.6171 1.7248 1.6663 1.2877 1.2273 5.3296 1.2452 4.5624 1.0916 1.0884 4.3238 5.5889 1.5779 5.6167 4.2287 1.0645 1.0860 1.0612 1.0884 1.1013 1.1041 1.0888 1.0984 1.0659 1.0735 1.0499 1.0667 1.1052
irintensity: 6.7241 8.5389 0.8922 3.5250 7.2445 5.0196 7.4315 9.0277 11.0819 12.6991 7.9581 25.3781 7.9652 137.8827 14.1178 3.0339 0.4601 0.3354 109.4259 9.1448 124.9590 165.4115 8.9837 10.6652 103.2064 2.5575 4.5328 12.5726 2.9414 6.9535 9.7577 14.5893 5.2115 10.6224 27.5574 5.6497 3.7025 19.6143 8.7697 50.8178 12.2402 17.3838 60.9251 83.7365 148.9200 40.3591 58.7010 54.2879 22.5096 36.5189 21.2133 21.1538 64.5624 43.4071 48.3363 5.4532 10.5331 15.8148 18.2461 7.0617 61.0922 26.9631 15.2190 75.1496 5.3620 12.4118 2.0183 146.5919 15.1809 29.6927 3.9807 13.2722 235.9851 123.8578 5.3530 708.0894 306.5984 33.1611 24.1194 9.2478 10.8555 31.4974 10.0874 5.2995 2.8127 11.1132 28.5183 87.6866 13.6409 44.2552
temp: 298.150 k
press: 1.00000 atm
elementType: 8 8 8 8 7 7 7 7 7 6 6 6 6 6 6 6 6 6 6 1 1 1 1 1 1 1 1 1 1 1 1 1
symmnumber: 1
zpe: 635489.7 jmol-1
zpe.correction: 0.242045 hartree
zpe.thermalcorrener: 0.259998 hartree
zpe.thermalcorrenthalpy: 0.260942 hartree
zpe.thermalcorrgfe: 0.194057 hartree
zpe.sumelectzpe: -962.063745 hartree
zpe.sumelectthermal: -962.045792 hartree
zpe.sumelectthermalent: -962.044848 hartree
zpe.sumelectthermalfe: -962.111734 hartree
dipole: 8.3905 8.0043 -1.4630
dipole: 11.6880
quadrupole: -138.4378 -106.4734 -113.6355
quadrupole: -39.8886 -1.3472 -0.2734
quadrupole: -18.9222 13.0422 5.8800 -39.8886 -1.3472 -0.2734
hfenergy: -962.3057907 hartree
pointgroup: C01 [X(C10H13N5O4)]
dipole: -3.0705952 3.4212934 -0.1074789 debye
polarizability: 195.3176781|-6.894967|162.7335398|-12.8443234|-17.9996951|103.3789048 unknown
InChI: InChI=1S/C10H13N5O4/c11-10-13-8-7(9(18)14-10)12-3-15(8)6-1-4(17)5(2-16)19-6/h3-6,13,16-17H,1-2,11H2
charge 0 multiplicity 1
32 atoms
O  -2.618829 -0.107586 1.318227
O  -4.045409 2.331402 0.196283
O  -3.995157 -1.199745 -2.054648
O  3.975999 -2.12682 0.133302
N  -0.263568 -0.255099 0.847007
N  1.512609 1.228005 -0.148536
N  1.005824 -2.150097 1.072614
N  3.645361 0.121351 -0.472879
N  3.37689 2.366715 -1.073943
C  -1.407961 0.674261 1.033631
C  -1.713395 1.523667 -0.238935
C  -3.235683 1.315133 -0.483375
C  -3.482063 -0.091623 0.090729
C  -3.124406 -1.243807 -0.873714
C  1.010612 0.037171 0.367405
C  -0.197505 -1.607242 1.284729
C  1.786694 -1.128308 0.496602
C  3.199024 -1.13976 0.062792
C  2.870261 1.185737 -0.557974
H  -1.222627 1.286405 1.935651
H  -1.138672 1.15021 -1.104128
H  -1.509954 2.598293 -0.099225
H  -3.516848 1.389281 -1.543719
H  -4.517536 -0.198812 0.458241
H  -3.190125 -2.21134 -0.338351
H  -2.1005 -1.139049 -1.268126
H  -1.058882 -2.093338 1.731162
H  -3.973725 2.195948 1.177356
H  0.954963 2.08019 -0.209168
H  -4.891235 -1.552279 -1.824701
H  4.351027 2.341998 -1.365678
H  2.828216 3.210639 -1.21283
