program: Gaussian 09
title: 000187777
version: EM64L-G09RevD.01
frameworkgroup: C1[X(C14H8Cl4)]
method: RPBEPBE
basis: SDD
operation: Freq
keyword: #pfreq=noraman
keyword: PBEPBE/SDD
title: #p freq=noraman PBEPBE/SDD
converged: YES YES NO YES
title: Mulliken charges:
elementType: Cl Cl Cl Cl C C C C C C C C C C C C C C H H H H H H H H
charge: -0.011052 -0.011053 0.000294 0.000294 0.557437 0.557437 -0.322180 -0.322180 -0.383012 -0.383012 -0.402900 -0.402901 -0.092140 -0.092140 -0.207440 -0.207439 -0.110566 -0.110567 0.221280 0.221280 0.257888 0.257888 0.233177 0.233177 0.259214 0.259214
chargesum: 0.00000
title: Mulliken charges with hydrogens summed into heavy atoms:
elementType: Cl Cl Cl Cl C C C C C C C C C C C C C C
charge: -0.011052 -0.011053 0.000294 0.000294 0.557437 0.557437 -0.100900 -0.100900 -0.125124 -0.125124 -0.169723 -0.169724 -0.092140 -0.092140 0.051774 0.051775 -0.110566 -0.110567
polarizability: 4.63985947e+02 2.17390038e+00 1.87578110e+02 2.35465020e-04 -2.74609525e-04 6.77367357e+01
1716.lowfreq: 0.0016 0.0018 0.0022 2.4821 4.7125 12.2051 16.8975 30.9246 43.3093
frequency: 16.8975 30.9246 43.3093 67.4673 125.3007 127.4050 146.1979 148.5283 182.6504 195.4268 200.8138 207.4955 283.4219 306.0055 344.5988 355.2743 377.1030 429.5111 431.5733 440.9772 442.5244 505.3306 510.5599 545.1532 596.0160 634.3257 655.4724 676.3800 698.5255 711.6291 735.5943 816.5140 820.3672 851.9872 874.0702 883.6965 884.6176 915.1508 954.2346 957.2710 984.9352 1000.1534 1000.5538 1121.9793 1123.6395 1151.5419 1156.6682 1201.8246 1236.6690 1259.6206 1266.0480 1290.8854 1323.4270 1365.5138 1380.4547 1389.8208 1399.6444 1461.2539 1472.1615 1553.2395 1558.4732 1586.0964 1599.0033 1646.6841 3098.8892 3109.2817 3149.1481 3149.4211 3151.3343 3151.3994 3173.7428 3173.7723
redmass: 9.4838 12.5270 10.4210 7.2127 3.6540 5.4664 14.6658 12.1128 29.5356 21.6489 3.2276 7.1330 9.4612 3.7931 8.8830 5.4238 10.5684 11.6021 7.5592 3.0843 3.1250 4.4322 8.8558 4.1901 4.9353 7.3956 7.1454 7.9052 3.4160 2.8567 7.0279 1.3484 1.4076 1.5579 5.8306 4.3211 1.5660 2.0118 1.3503 1.3717 1.1468 5.1979 5.1862 2.2129 2.3451 1.4337 1.3943 2.4379 1.4877 1.6572 1.4379 2.4535 1.5262 2.8154 4.9186 4.4957 2.8060 2.6576 3.0007 7.8459 6.7521 6.3353 6.5181 5.2629 1.0922 1.0859 1.0919 1.0921 1.0881 1.0883 1.0968 1.0968
irintensity: 0.8314 0.1583 1.0700 0.0000 0.0000 0.5144 0.0000 0.0000 0.0806 0.0000 0.0000 0.6861 1.7243 0.0000 0.0000 1.8588 21.4962 31.4029 0.0000 0.0000 15.2841 1.3495 0.0000 0.0000 13.2042 21.7497 0.0000 38.8779 0.0000 10.6376 0.0001 0.0000 52.5110 0.0000 61.5245 0.0098 32.4093 0.0000 7.6602 0.0000 62.3054 0.0001 56.9629 156.8026 0.0000 1.0715 0.0000 0.0000 33.4383 0.0000 21.0940 7.9394 0.0000 0.0000 1.6943 0.0000 36.4988 0.0000 219.3640 0.0000 52.2279 0.0000 12.0683 0.0000 0.0000 42.4896 0.0000 5.0231 8.5632 0.0000 7.5904 0.0005
temp: 298.150 k
press: 1.00000 atm
elementType: 17 17 17 17 6 6 6 6 6 6 6 6 6 6 6 6 6 6 1 1 1 1 1 1 1 1
symmnumber: 1
zpe: 453489.8 jmol-1
zpe.correction: 0.172725 hartree
zpe.thermalcorrener: 0.189301 hartree
zpe.thermalcorrenthalpy: 0.190245 hartree
zpe.thermalcorrgfe: 0.125180 hartree
zpe.sumelectzpe: -2377.270915 hartree
zpe.sumelectthermal: -2377.254339 hartree
zpe.sumelectthermalent: -2377.253395 hartree
zpe.sumelectthermalfe: -2377.318460 hartree
dipole: 0.0000 0.0000 0.0014
dipole: 0.0014
quadrupole: -167.9644 -118.9249 -136.9766
quadrupole: 7.3446 -0.0002 -0.0001
quadrupole: -26.6758 22.3637 4.3120 7.3446 -0.0002 -0.0001
hfenergy: -2377.4436403 hartree
pointgroup: C01 [X(C14H8Cl4)]
dipole: 0.000001 -0.0000024 0.0005538 debye
dipolederiv: -0.4475292 0.3063372 0.0006178 0.4694699 -0.4508129 -0.0008775 0.0010301 -0.0009427 -0.0345978 -0.4475283 0.3063376 0.0002143 0.469471 -0.4508159 -0.0003383 0.0004492 -0.0004245 -0.0345965 -1.009588 -0.1838496 -0.0009516 -0.268116 -0.1106403 -0.0003512 -0.0011837 -0.0003147 -0.0246579 -1.0095884 -0.1838495 -0.0007273 -0.2681156 -0.1106403 -0.0002483 -0.0008622 -0.0002088 -0.0246574 0.4485847 -0.0040858 0.0001501 -0.0245272 -0.0021406 -0.0001092 0.0000575 -0.0000955 0.0503597 0.4485859 -0.004086 0.0002038 -0.0245276 -0.0021402 -0.0001303 0.0001942 -0.0001204 0.0503597 0.0296914 0.0231639 0.0001445 0.252604 0.1227295 0.0006537 0.0005446 0.0005536 -0.1580762 0.0296894 0.0231635 0.0001256 0.2526042 0.1227286 0.0007357 0.0006675 0.0006134 -0.158076 -0.3391748 0.1651421 0.0003405 0.0968128 -0.1055532 0.0000987 0.0002772 0.0001277 -0.1285216 -0.3391754 0.1651428 0.0001223 0.0968135 -0.1055534 0.0000845 -0.0001148 0.000128 -0.128522 -0.1612843 -0.0223679 -0.0000536 -0.0439708 0.0079109 0.0003753 -0.0000939 0.0003308 -0.1492548 -0.1612844 -0.022368 -0.000033 -0.0439709 0.0079114 0.0001983 -0.0000691 0.0002593 -0.1492554 0.480409 -0.6215572 -0.0014257 -0.8470882 0.63953 0.0013517 -0.0021164 0.0014556 -0.0231205 0.4804075 -0.6215583 -0.0005882 -0.8470896 0.6395343 0.0004918 -0.0007944 0.0005889 -0.0231227 -0.2802425 -0.0817598 -0.0003255 0.1345395 0.0471786 0.0003742 0.0002802 0.0002778 -0.0802486 -0.2802425 -0.0817597 -0.0002025 0.1345402 0.047179 0.0002552 0.0000335 0.0001458 -0.080249 1.0879333 0.4352414 0.0017235 0.3681124 -0.0273439 0.0002773 0.0016 0.0003183 -0.0701951 1.0879343 0.4352417 0.001146 0.3681118 -0.0273439 0.0002464 0.0010629 0.0002783 -0.0701958 0.0565332 -0.0184748 -0.000064 -0.1107957 -0.0887412 -0.0005216 -0.0002921 -0.0004837 0.1465253 0.0565335 -0.0184744 -0.0000984 -0.1107958 -0.088741 -0.0005445 -0.0002431 -0.0004899 0.1465254 0.0761173 -0.0625488 -0.0001837 -0.0577426 -0.0127069 -0.0004676 -0.0001147 -0.0004591 0.1598171 0.0761171 -0.0625489 -0.000146 -0.0577426 -0.0127077 -0.0002739 -0.0001866 -0.0002926 0.1598175 0.0101434 0.0990845 0.0001803 0.0807819 0.0049991 -0.0003195 0.0001271 -0.0002853 0.1494553 0.0101435 0.0990847 0.0000749 0.080782 0.0049984 -0.0001728 0.000061 -0.0001861 0.1494556 0.0484072 -0.0343252 -0.0001416 -0.05008 -0.0244088 -0.000492 -0.0001831 -0.0004776 0.1625155 0.0484072 -0.0343254 -0.0001025 -0.0500804 -0.0244096 -0.000296 -0.0001311 -0.0002967 0.1625162 unknown
polarizability: 463.8075769|-7.3469732|187.755931|0.171829|0.2353939|67.737285 unknown
InChI: InChI=1S/C14H8Cl4/c15-11-5-3-9(7-13(11)17)1-2-10-4-6-12(16)14(18)8-10/h1-8H
charge 0 multiplicity 1
26 atoms
Cl 5.491902 -2.150755 -0.090003
Cl -5.490983 2.15637 -0.086578
Cl 6.500994 0.989473 -0.081304
Cl -6.50008 -0.983865 -0.091397
C  1.956629 -0.042618 -0.086009
C  -1.955713 0.048225 -0.087646
C  0.536785 -0.423568 -0.087457
C  -0.535869 0.429175 -0.086224
C  2.93435 -1.077388 -0.088265
C  -2.933433 1.082998 -0.08671
C  2.416014 1.307798 -0.082477
C  -2.4151 -1.302193 -0.089891
C  4.308974 -0.779027 -0.086951
C  -4.308057 0.784637 -0.087872
C  3.789444 1.604243 -0.08111
C  -3.78853 -1.598638 -0.090994
C  4.744859 0.562453 -0.083291
C  -4.743944 -0.556846 -0.089955
H  0.351555 -1.506588 -0.089658
H  -0.35064 1.512194 -0.083826
H  2.620542 -2.126628 -0.091076
H  -2.619624 2.13224 -0.085042
H  1.702342 2.137072 -0.080808
H  -1.701429 -2.131469 -0.090806
H  4.136541 2.641607 -0.078362
H  -4.135628 -2.636004 -0.092687
