program: Gaussian 09
title: 000185213
version: EM64L-G09RevD.01
frameworkgroup: C1[X(C14H21NOS)]
method: RPBEPBE
basis: SDD
operation: Freq
keyword: #p
keyword: freq=noraman
keyword: PBEPBE/SDD
title: #p freq=noraman PBEPBE/SDD
converged: YES YES NO NO
title: Mulliken charges:
elementType: S O N C C C C C C C C C C C C C C H H H H H H H H H H H H H H H H H H H H H
charge: 0.107809 -0.257570 -0.070541 -0.183356 -0.388288 -0.459692 0.487538 -0.747206 -0.447745 -0.398006 -0.638689 -0.021739 -0.238427 -0.246256 -0.246015 -0.590234 -0.621863 0.229705 0.205962 0.222740 0.225131 0.281345 0.232601 0.205160 0.212006 0.290659 0.221746 0.250571 0.234108 0.255297 0.225450 0.219729 0.225099 0.291191 0.246731 0.221510 0.248048 0.215493
chargesum: 0.00000
title: Mulliken charges with hydrogens summed into heavy atoms:
elementType: S O N C C C C C C C C C C C C C C
charge: 0.107809 -0.257570 -0.070541 0.046348 0.040414 0.046784 0.487538 -0.097439 -0.157086 -0.176260 0.101286 -0.021739 -0.012977 -0.026527 -0.020916 -0.052312 0.063188
polarizability: 2.15589124e+02 -3.99820518e+00 1.89078082e+02 1.62379314e+01 9.41244683e+00 1.24066374e+02
1716.lowfreq: -12.5948 -6.1465 -0.0005 0.0010 0.0013 1.4088 18.6395 22.4374 35.3861
frequency: 16.7732 21.6894 35.0839 49.1829 61.5587 68.2442 76.9879 96.6669 117.6303 161.7085 196.0064 200.6311 230.6182 243.0876 246.5494 270.7862 294.3660 333.5179 343.3324 355.0376 402.6141 407.5314 420.1379 467.0907 513.0498 545.6050 556.5892 613.5617 616.5947 621.2032 658.3236 706.4752 727.2694 754.7098 768.2211 811.1761 834.8209 855.2431 918.7774 926.9096 966.4493 976.7126 983.1897 989.2324 995.1458 1004.8573 1029.6666 1044.9109 1059.2353 1063.9613 1072.4820 1083.4804 1103.4818 1106.1436 1115.2349 1150.9396 1171.3209 1193.6962 1208.5181 1226.3930 1248.0056 1255.7071 1282.6720 1297.4223 1306.8370 1334.2897 1350.1548 1352.2158 1367.3543 1382.7444 1390.6495 1391.0405 1427.9613 1440.6275 1444.3104 1455.2984 1463.9579 1465.4751 1472.6989 1475.2745 1479.9996 1480.7886 1487.0905 1489.9518 1590.2557 1612.4169 1620.4225 2970.4162 2975.6281 2978.1798 2982.0059 2992.8748 2995.1584 3031.1779 3033.4422 3059.1226 3064.9003 3075.3767 3081.2901 3084.1111 3092.3388 3100.6730 3113.8938 3118.9420 3122.6980 3133.9733 3143.1904 3159.4265
redmass: 3.7510 3.7792 3.5893 4.1591 2.9408 3.3508 3.0991 1.5677 3.9963 2.8129 2.4861 1.8740 2.2836 1.8578 1.6447 1.7432 2.6748 3.6280 2.7509 3.8352 2.8294 2.4030 6.9827 3.2847 3.0736 2.9453 2.9624 6.3980 6.3691 7.2786 5.2146 1.7026 3.5126 1.1948 1.8818 3.0038 2.1952 1.2507 1.5428 1.5971 1.6334 1.4673 1.7343 3.3610 1.4859 2.3433 2.2194 2.0242 1.3233 1.7518 2.2285 2.0669 1.4944 2.3395 1.6909 1.6061 1.0571 1.1647 1.5989 1.8442 2.1141 1.2869 1.2095 1.3921 1.4391 1.5070 1.4550 1.4236 1.6117 4.1402 1.2082 1.2741 1.1078 1.9402 1.2282 1.0875 1.0833 1.0417 1.0528 1.1317 1.0511 1.0731 1.7575 1.1076 5.8633 5.9131 8.1073 1.0576 1.0383 1.0360 1.0371 1.0837 1.0667 1.1001 1.0592 1.1014 1.0988 1.0960 1.0997 1.0976 1.1014 1.0993 1.0848 1.1059 1.0869 1.0922 1.0961 1.1015
irintensity: 0.0965 0.0604 0.2782 0.4680 1.4320 1.1278 5.4793 0.4900 1.6295 1.8352 0.8437 5.3481 0.2881 1.4710 1.6789 1.3388 2.1373 19.5555 0.2388 8.6549 1.0420 4.1487 2.6450 3.3178 4.2619 11.6252 3.2149 10.4883 0.4863 8.5174 24.4384 58.7432 6.4002 5.1546 49.4983 31.9148 0.8028 1.3252 3.6565 8.7368 6.7966 1.4379 37.2542 1.0522 0.1571 8.9090 10.3608 8.4428 13.3659 135.2466 3.5610 36.9537 13.8335 7.9953 4.6515 40.3571 0.0970 0.0632 5.1663 2.3530 121.1075 7.2752 8.7865 8.8171 6.4351 34.8512 19.3497 8.2281 33.4601 3.0257 18.2795 8.2615 20.1736 4.2243 15.6102 16.9236 20.2139 15.8800 16.2350 11.3608 7.0308 5.5636 24.4297 52.7913 2.9552 4.6720 238.8641 9.3082 39.5530 36.0996 33.5372 13.2012 52.3210 44.5151 20.6082 20.7618 57.1690 33.3559 27.5769 8.9630 9.9803 20.4715 5.0735 16.4050 3.7052 23.6318 21.8036 34.7738
temp: 298.150 k
press: 1.00000 atm
elementType: 16 8 7 6 6 6 6 6 6 6 6 6 6 6 6 6 6 1 1 1 1 1 1 1 1 1 1 1 1 1 1 1 1 1 1 1 1 1
symmnumber: 1
zpe: 841960.8 jmol-1
zpe.correction: 0.320686 hartree
zpe.thermalcorrener: 0.339889 hartree
zpe.thermalcorrenthalpy: 0.340833 hartree
zpe.thermalcorrgfe: 0.270173 hartree
zpe.sumelectzpe: -1072.831511 hartree
zpe.sumelectthermal: -1072.812309 hartree
zpe.sumelectthermalent: -1072.811364 hartree
zpe.sumelectthermalfe: -1072.882025 hartree
dipole: 0.3616 2.5488 0.2130
dipole: 2.5831
quadrupole: -107.7450 -99.6064 -113.2742
quadrupole: -2.7055 2.5731 -1.3901
quadrupole: -0.8699 7.2688 -6.3990 -2.7055 2.5731 -1.3901
hfenergy: -1073.1521973 hartree
pointgroup: C01 [X(C14H21N1O1S1)]
dipole: -0.0005492 -1.0155632 0.0382168 debye
polarizability: 215.9302165|-1.6092622|190.3272061|-15.4269364|3.6251862|122.4761576 unknown
InChI: InChI=1S/C14H21NOS/c1-4-17-14(16)15(3)11-10-12(2)13-8-6-5-7-9-13/h5-9,12H,4,10-11H2,1-3H3
charge 0 multiplicity 1
38 atoms
S  4.039481 -0.626381 0.121467
O  1.754085 0.818441 0.700189
N  1.581428 -1.501644 0.991102
C  -1.058169 -0.939555 -0.827579
C  -0.826444 -1.944087 0.345986
C  0.158735 -1.433923 1.425233
C  -1.968897 0.214583 -0.387418
C  -1.597983 -1.683364 -2.074471
C  -1.41848 1.476278 -0.041436
C  -3.375352 0.041476 -0.282691
C  2.217065 -2.830281 0.901376
C  2.24985 -0.342859 0.660845
C  -2.250836 2.536839 0.386235
C  -4.208785 1.099331 0.142893
C  -3.649296 2.354809 0.478404
C  4.455474 1.177471 -0.289523
C  4.059273 1.559379 -1.721048
H  -0.073253 -0.508369 -1.094985
H  -0.454419 -2.906214 -0.061393
H  -1.798036 -2.162615 0.832111
H  0.060852 -2.040091 2.346822
H  -0.062305 -0.384388 1.681311
H  -1.808884 -0.978056 -2.897905
H  -2.532644 -2.231926 -1.852858
H  -0.858094 -2.422823 -2.433983
H  -0.332565 1.618549 -0.089356
H  -3.828045 -0.923146 -0.543525
H  2.366653 -3.149882 -0.146829
H  1.568575 -3.565892 1.404256
H  3.198582 -2.832457 1.408606
H  -1.804459 3.502894 0.64907
H  -5.292374 0.946707 0.21118
H  -4.294906 3.177413 0.806755
H  3.913205 1.785848 0.452508
H  5.541545 1.254804 -0.113665
H  4.553318 0.911893 -2.466439
H  2.966873 1.477932 -1.851697
H  4.35063 2.607706 -1.92655
