program: Gaussian 09
title: 000185211
version: EM64L-G09RevD.01
frameworkgroup: C1[X(C13H19NOS)]
method: RPBEPBE
basis: SDD
operation: Freq
keyword: #p
keyword: freq=noraman
keyword: PBEPBE/SDD
title: #p freq=noraman PBEPBE/SDD
converged: YES YES NO NO
title: Mulliken charges:
elementType: S O N C C C C C C C C C C C C C H H H H H H H H H H H H H H H H H H H
charge: 0.103759 -0.264204 -0.072967 -0.207523 -0.451220 0.523313 -0.704157 -0.389707 -0.444330 -0.635309 0.001976 -0.250585 -0.227371 -0.247377 -0.590541 -0.623382 0.209273 0.223727 0.255309 0.209172 0.224360 0.231844 0.261050 0.226987 0.251664 0.228571 0.254845 0.227195 0.223575 0.227231 0.244562 0.291107 0.255680 0.221628 0.211845
chargesum: 0.00000
title: Mulliken charges with hydrogens summed into heavy atoms:
elementType: S O N C C C C C C C C C C C C C
charge: 0.103759 -0.264204 -0.072967 0.001750 0.027817 0.523313 -0.038782 -0.128657 -0.217343 0.099771 0.001976 -0.023390 -0.003796 -0.020145 -0.054872 0.065771
polarizability: 1.67513996e+02 2.01622067e+01 1.76108750e+02 -1.33804216e+01 -2.94157462e+00 1.42851175e+02
1716.lowfreq: -10.1758 -7.3241 -0.0024 -0.0019 -0.0012 1.9872 20.1350 28.3818 41.0915
frequency: 19.5315 27.9884 41.0418 58.6564 67.7910 88.8257 103.6169 105.0760 154.6643 177.2788 193.8671 220.1120 237.2067 254.5700 265.3094 281.1566 333.4696 347.8490 383.4385 403.7437 427.5295 450.3008 506.5389 552.4631 562.1935 612.7634 616.9033 621.6734 667.4078 706.3321 735.1262 755.1112 770.2630 850.9037 861.0852 917.7822 927.0425 940.2421 975.4025 982.3253 989.9370 994.9310 1013.3809 1032.8456 1058.1006 1060.6671 1069.5439 1075.4366 1090.1356 1105.5369 1123.0515 1171.8717 1187.6295 1196.2223 1217.5468 1243.4196 1253.8908 1282.7968 1287.0280 1314.1107 1345.5471 1354.2801 1372.6756 1385.5422 1389.0268 1390.5569 1427.6334 1442.6302 1443.3138 1463.2552 1463.8630 1471.5398 1472.6520 1477.2938 1478.9542 1485.8417 1488.2854 1592.8603 1613.2662 1615.8710 2970.1352 2973.5028 2975.3882 2979.7609 2980.4178 3033.1466 3061.5091 3068.9532 3074.2761 3081.1580 3087.2247 3090.2909 3091.3224 3106.2011 3118.4063 3122.7676 3134.4188 3145.3677 3161.3182
redmass: 4.5049 3.8610 3.7711 2.6176 4.5639 6.2323 1.2412 2.8575 3.7250 2.3662 1.5499 1.2159 2.9443 1.8837 3.1980 2.7212 3.4253 3.6406 2.3731 2.8198 9.2458 3.6761 3.4349 3.1522 3.3555 6.9459 6.3900 7.0912 5.9650 1.6771 3.9245 1.1845 1.8923 1.3829 2.0600 1.3863 1.6892 2.3087 1.4293 1.7360 3.7461 1.4657 2.4256 1.9520 1.4985 1.6098 2.2923 1.9498 1.8743 1.4418 1.9377 1.0622 1.5997 1.2336 2.2343 2.3681 1.2428 1.2336 1.3662 1.4943 1.4662 1.4644 1.9541 2.6986 1.4212 1.2083 1.1100 1.5859 1.4370 1.0802 1.0480 1.0444 1.0725 1.1479 1.0462 1.1080 1.7954 5.9097 6.5662 7.3949 1.0760 1.0453 1.0374 1.0599 1.0401 1.0592 1.0997 1.0995 1.0959 1.0954 1.0988 1.1005 1.1012 1.0876 1.1060 1.0857 1.0912 1.0956 1.1014
irintensity: 0.1025 0.3541 0.4151 0.8354 2.7755 5.9985 0.6632 0.0069 0.1386 0.5316 4.4637 1.3715 0.6509 0.3371 3.5696 3.4747 13.9614 0.2066 7.0496 0.6315 4.8293 3.4421 19.6411 0.5274 9.1650 8.9996 1.7049 11.4836 31.9218 61.8978 3.1999 5.5427 40.9639 6.6775 12.9836 6.5972 4.0717 6.3802 0.1721 37.9325 0.0461 0.4578 11.8990 3.4946 51.4293 31.4124 51.9622 58.8050 21.8164 17.9593 22.1133 0.4961 21.5826 1.2907 1.8962 98.6396 1.0980 15.7115 8.4896 12.7735 30.9396 3.2233 35.1381 8.6534 10.3331 14.2748 21.9850 0.8943 21.7702 13.3877 8.1031 30.6304 27.6756 4.5720 7.0756 40.7191 15.0000 3.7058 69.6268 140.1154 9.3670 12.7391 48.0621 112.4964 4.9492 23.0135 24.3253 36.8326 35.6988 22.2552 17.6136 14.4082 14.6126 12.6062 14.5034 0.0727 18.8124 28.7591 21.3311
temp: 298.150 k
press: 1.00000 atm
elementType: 16 8 7 6 6 6 6 6 6 6 6 6 6 6 6 6 1 1 1 1 1 1 1 1 1 1 1 1 1 1 1 1 1 1 1
symmnumber: 1
zpe: 768021.2 jmol-1
zpe.correction: 0.292524 hartree
zpe.thermalcorrener: 0.310460 hartree
zpe.thermalcorrenthalpy: 0.311404 hartree
zpe.thermalcorrgfe: 0.244448 hartree
zpe.sumelectzpe: -1033.608317 hartree
zpe.sumelectthermal: -1033.590381 hartree
zpe.sumelectthermalent: -1033.589437 hartree
zpe.sumelectthermalfe: -1033.656393 hartree
dipole: -1.5327 -1.0701 1.5353
dipole: 2.4190
quadrupole: -102.7138 -94.1888 -104.9083
quadrupole: 6.3285 -2.6771 -3.0644
quadrupole: -2.1102 6.4149 -4.3047 6.3285 -2.6771 -3.0644
hfenergy: -1033.9008411 hartree
pointgroup: C01 [X(C13H19N1O1S1)]
dipole: -0.6255904 0.3905523 -0.6015142 debye
polarizability: 169.7467364|-20.572434|173.9272349|13.3939849|-2.0474646|142.7999503 unknown
InChI: InChI=1S/C13H19NOS/c1-4-16-13(15)14(3)10-11(2)12-8-6-5-7-9-12/h5-9,11H,4,10H2,1-3H3
charge 0 multiplicity 1
35 atoms
S  3.220303 0.629653 -0.979163
O  1.88623 0.716273 1.4371
N  0.802791 1.791863 -0.33818
C  -1.702381 1.485197 0.022944
C  -0.370409 2.129685 0.499686
C  -1.644172 -0.036762 -0.130315
C  -2.831031 1.899335 1.008547
C  -1.00035 -0.867097 0.823931
C  -2.300134 -0.653361 -1.226767
C  0.764363 2.184661 -1.756421
C  1.835393 1.069068 0.22506
C  -1.018305 -2.272767 0.683667
C  -2.322498 -2.059163 -1.369187
C  -1.680957 -2.87606 -0.410398
C  4.255277 -0.408133 0.223846
C  3.795128 -1.870648 0.270929
H  -1.955599 1.912961 -0.9691
H  -0.498104 3.231789 0.504833
H  -0.132023 1.817928 1.52985
H  -2.904592 3.000376 1.093401
H  -2.639339 1.487206 2.016378
H  -3.807435 1.512845 0.668157
H  -0.460249 -0.42321 1.667749
H  -2.80032 -0.025305 -1.976036
H  1.780256 2.394934 -2.130168
H  0.168684 3.109409 -1.853167
H  0.31045 1.399523 -2.390426
H  -0.509408 -2.896821 1.427292
H  -2.83431 -2.514034 -2.225107
H  -1.691846 -3.966623 -0.517356
H  5.29177 -0.297562 -0.136668
H  4.14661 0.078266 1.206921
H  2.750891 -1.93236 0.622075
H  3.859804 -2.349306 -0.72187
H  4.430012 -2.443762 0.974463
