program: Gaussian 09
title: 000187760
version: EM64L-G09RevD.01
frameworkgroup: C1[X(C16H22Cl2N2O)]
method: RPBEPBE
basis: SDD
operation: Freq
keyword: #p
keyword: freq=noraman
keyword: PBEPBE/SDD
title: #p freq=noraman PBEPBE/SDD
converged: NO YES NO NO
title: Mulliken charges:
elementType: Cl Cl O N N C C C C C C C C C C C C C C C C H H H H H H H H H H H H H H H H H H H H H H
charge: -0.014055 0.001483 -0.274681 -0.169990 -0.387616 0.524037 -0.500626 -0.517154 -0.392796 -0.385872 -0.395799 -0.500769 -0.651419 -0.649368 0.160265 0.326264 -0.340230 -0.368523 -0.080707 -0.200769 -0.101994 0.223589 0.206369 0.189316 0.200537 0.215656 0.190241 0.186700 0.219270 0.184987 0.201338 0.261221 0.228986 0.236816 0.194043 0.219204 0.213231 0.200666 0.244071 0.307315 0.248666 0.284643 0.263455
chargesum: 0.00000
title: Mulliken charges with hydrogens summed into heavy atoms:
elementType: Cl Cl O N N C C C C C C C C C C C C C C C C
charge: -0.014055 0.001483 -0.274681 -0.169990 -0.080301 0.524037 -0.070669 -0.127301 0.013100 0.020098 -0.009474 -0.010562 -0.001356 0.008600 0.160265 0.326264 -0.091564 -0.083881 -0.080707 0.062687 -0.101994
polarizability: 3.11551454e+02 -1.12550401e+01 2.06151080e+02 -1.44894548e+01 -1.57671226e+01 1.43287273e+02
1716.lowfreq: -7.9167 -4.2058 -0.0024 -0.0021 0.0006 7.5673 19.8136 23.1268 30.4464
frequency: 18.2286 21.8515 24.1454 53.7050 68.8337 81.9370 103.7152 124.5371 150.5621 160.3753 174.3383 175.7580 184.0671 206.8863 224.4075 230.9394 282.5479 285.1734 303.7133 318.1928 340.5448 363.0453 368.7804 414.4607 420.3478 425.8557 435.2555 450.5703 477.6791 502.3462 512.9484 528.0489 555.2496 561.1601 592.7420 657.4821 660.5873 685.5154 722.7105 733.5722 781.5033 791.7506 818.5170 842.1074 844.1378 879.9018 884.9565 887.6897 923.1501 953.1166 971.6379 978.9139 987.7868 1001.5100 1021.9640 1040.3714 1047.2307 1078.7889 1081.2931 1088.0935 1099.0977 1119.6193 1130.8337 1135.8751 1136.7570 1148.6277 1157.0287 1182.5420 1229.7164 1234.9403 1254.8246 1258.1959 1263.2503 1266.8342 1279.1057 1304.6949 1323.8158 1340.1862 1341.2875 1343.5543 1345.7107 1358.5473 1362.3034 1379.5653 1417.9309 1440.5695 1445.6135 1451.2921 1452.1175 1459.2277 1460.6544 1468.4852 1475.6034 1478.5240 1482.5095 1495.8977 1496.7724 1499.5115 1554.8399 1591.2883 1598.5508 2862.9211 2878.8676 2959.1820 2962.9192 2984.8155 2985.2818 2991.4480 2993.0420 3015.3212 3019.0875 3022.4650 3026.5749 3042.2349 3048.8733 3056.1425 3068.7028 3087.1414 3095.1655 3147.5351 3160.5417 3178.3882 3561.1849
redmass: 4.2051 5.6749 7.3180 6.6430 2.2744 7.5459 5.3612 3.0590 3.8812 4.0993 1.7620 1.3834 21.3424 1.2524 5.4667 4.7801 4.3923 3.2996 2.5266 3.8171 4.4558 2.3287 4.2709 3.1649 2.7548 2.6399 3.0066 2.9770 2.4557 3.0156 4.1219 2.5583 2.4236 2.3174 2.1653 5.9482 3.9577 5.3384 4.7093 3.6158 1.5693 2.1545 3.3696 1.3904 2.6444 1.5847 2.3192 1.9698 1.4441 2.5259 2.0183 1.3620 2.1940 5.2953 3.7492 1.4775 2.0219 1.3724 2.9243 1.2448 1.4629 1.9883 1.6090 1.7182 1.8558 2.2409 2.5565 1.7894 2.0113 1.6317 1.4342 1.5047 1.3609 1.7229 1.8928 1.4010 1.6814 1.3713 1.4080 1.3929 1.4398 3.8480 1.4372 5.7634 1.1357 1.1488 1.1916 1.3338 1.4892 1.0745 1.0846 1.0956 1.0757 1.0620 1.1112 1.0597 1.1711 1.5550 8.0523 6.5565 7.5994 1.0575 1.0580 1.0633 1.0606 1.0635 1.0600 1.0614 1.0642 1.0947 1.0771 1.0760 1.0955 1.1005 1.1005 1.1013 1.0999 1.0962 1.0960 1.0915 1.0887 1.0973 1.0772
irintensity: 0.0889 0.0103 0.1525 4.0895 0.2849 4.7829 3.7805 0.7249 0.1382 0.3852 1.2756 0.4278 0.0347 0.0630 2.6171 5.0635 0.2283 3.7935 1.2873 4.9702 10.2540 0.3032 16.4624 3.0113 1.8949 5.2300 6.3491 7.8425 1.3899 2.0520 20.2189 34.0670 49.5657 22.8682 20.2481 11.6251 8.5006 5.0374 15.7125 21.1521 2.4840 6.9649 7.0570 23.2681 5.5066 18.1855 4.0350 1.0848 6.6492 25.0348 25.6794 2.3116 50.5876 40.2311 1.5928 10.7519 8.8500 0.6809 33.0074 4.6931 0.0793 37.0617 19.1915 11.9500 3.1144 2.1974 10.8963 6.1653 22.5858 2.7537 26.7177 16.0424 10.0135 68.4091 1.8211 18.3986 3.0924 0.3468 24.9994 14.9822 3.5484 3.7338 22.4611 7.8993 9.2920 6.4761 74.0575 48.9857 50.4418 0.2298 7.1004 10.1380 27.7579 2.9998 10.6242 7.5012 46.9517 111.0186 73.5223 14.2352 85.1010 81.6329 141.7690 32.9419 38.0369 33.6629 54.1056 40.4809 16.9714 42.9449 77.4869 52.5003 74.4834 19.2452 18.9877 95.2271 4.3393 33.4939 25.6799 3.1253 0.4460 2.1044 12.2843
temp: 298.150 k
press: 1.00000 atm
elementType: 17 17 8 7 7 6 6 6 6 6 6 6 6 6 6 6 6 6 6 6 6 1 1 1 1 1 1 1 1 1 1 1 1 1 1 1 1 1 1 1 1 1 1
symmnumber: 1
zpe: 926635.6 jmol-1
zpe.correction: 0.352937 hartree
zpe.thermalcorrener: 0.374484 hartree
zpe.thermalcorrenthalpy: 0.375428 hartree
zpe.thermalcorrgfe: 0.300283 hartree
zpe.sumelectzpe: -1726.142978 hartree
zpe.sumelectthermal: -1726.121430 hartree
zpe.sumelectthermalent: -1726.120486 hartree
zpe.sumelectthermalfe: -1726.195632 hartree
dipole: 2.3516 0.4764 -2.1014
dipole: 3.1895
quadrupole: -142.0458 -144.9139 -139.4153
quadrupole: 5.6220 -5.5304 1.1028
quadrupole: 0.0792 -2.7889 2.7096 5.6220 -5.5304 1.1028
hfenergy: -1726.4959144 hartree
pointgroup: C01 [X(C16H22Cl2N2O1)]
dipole: 0.9492948 -0.0156087 -0.8204954 debye
polarizability: 309.722228|-20.6411601|201.9234039|-9.8414511|-24.6357277|149.3441748 unknown
InChI: InChI=1S/C16H22Cl2N2O/c1-20(2)16(8-4-3-5-9-16)11-19-15(21)12-6-7-13(17)14(18)10-12/h6-7,10,19H,3-5,8-9,11H2,1-2H3
charge 0 multiplicity 1
43 atoms
Cl -4.153041 2.608689 -1.189569
Cl -6.573389 0.694862 -0.049258
O  -0.458458 -2.231716 0.937507
N  3.971716 -0.674264 -0.310112
N  0.149609 -0.788412 -0.789563
C  2.571935 -0.137062 -0.222737
C  2.205732 0.183106 1.257534
C  2.463928 1.203368 -1.013572
C  3.134879 1.255283 1.870116
C  3.40136 2.29516 -0.447407
C  3.095156 2.564496 1.0456
C  1.561927 -1.196998 -0.806895
C  4.549549 -0.828856 -1.658998
C  4.300288 -1.823689 0.556979
C  -0.766678 -1.321315 0.103471
C  -2.172288 -0.775175 0.026994
C  -2.479112 0.505627 -0.497054
C  -3.219066 -1.579461 0.543939
C  -3.813141 0.957887 -0.522802
C  -4.551568 -1.128063 0.512824
C  -4.852293 0.142233 -0.025658
H  2.197458 -0.736509 1.869859
H  1.163184 0.557716 1.266332
H  1.41649 1.558823 -0.922647
H  2.649873 1.048626 -2.094543
H  4.172868 0.871437 1.889803
H  2.834438 1.454647 2.917271
H  3.291072 3.227054 -1.036121
H  4.450971 1.959526 -0.547652
H  2.086791 3.021505 1.134671
H  3.8163 3.297746 1.455628
H  1.622842 -2.124936 -0.211524
H  1.847423 -1.42893 -1.851347
H  4.472767 0.111063 -2.229103
H  4.092104 -1.644422 -2.272634
H  5.625077 -1.064581 -1.557563
H  5.391343 -1.997769 0.512954
H  3.799611 -2.780058 0.26866
H  4.043625 -1.610557 1.606794
H  -0.176057 -0.151297 -1.516937
H  -1.696043 1.184232 -0.851174
H  -2.962678 -2.551885 0.974341
H  -5.363201 -1.74873 0.902993
