program: Gaussian 09
title: 000185210
version: EM64L-G09RevD.01
frameworkgroup: C1[X(C14H21NOS)]
method: RPBEPBE
basis: SDD
operation: Freq
keyword: #p
keyword: freq=noraman
keyword: PBEPBE/SDD
title: #p freq=noraman PBEPBE/SDD
converged: YES YES NO NO
title: Mulliken charges:
elementType: S O N C C C C C C C C C C C C C C H H H H H H H H H H H H H H H H H H H H H
charge: 0.097598 -0.250797 -0.078843 -0.344929 -0.366919 -0.422339 -0.574523 0.504027 -0.630760 -0.415404 -0.410348 -0.034807 -0.228338 -0.228874 -0.243534 -0.586875 -0.623877 0.196318 0.231136 0.216762 0.207636 0.253583 0.219096 0.213378 0.206733 0.275866 0.231617 0.227381 0.230004 0.232715 0.222923 0.223540 0.227251 0.291380 0.245316 0.253570 0.219189 0.214146
chargesum: 0.00000
title: Mulliken charges with hydrogens summed into heavy atoms:
elementType: S O N C C C C C C C C C C C C C C
charge: 0.097598 -0.250797 -0.078843 0.082524 0.057479 0.050340 -0.154412 0.504027 0.104104 -0.185400 -0.177632 -0.034807 -0.005415 -0.005334 -0.016283 -0.050179 0.063027
polarizability: 2.29033744e+02 -1.32922678e+01 1.90250692e+02 2.11174517e+01 1.01022363e+01 1.15622040e+02
1716.lowfreq: -11.6067 -6.1535 -3.3731 -0.0021 -0.0009 0.0025 12.9747 17.0852 28.8504
frequency: 12.8555 16.9436 28.6515 40.7324 52.3896 57.0335 85.8438 94.2203 109.5190 118.9579 125.7705 181.8074 191.3281 230.7759 249.5127 272.3931 323.1440 336.7209 345.2793 362.6207 400.3704 402.8372 430.2377 462.5764 507.0873 583.8450 612.2716 617.5207 617.5511 690.6150 705.7896 742.6822 752.1464 760.8210 782.6505 808.9144 853.6932 887.7890 905.7298 917.2165 975.7744 982.8243 989.8021 993.4993 1004.6244 1026.6925 1046.4254 1050.7071 1058.8278 1063.3934 1068.8590 1074.3439 1097.8372 1117.1940 1123.9707 1171.6187 1186.2906 1214.9630 1222.6643 1239.3093 1249.1900 1254.2314 1280.6813 1285.3265 1288.5898 1305.8300 1327.2974 1343.6456 1355.4707 1373.2058 1382.2065 1389.6315 1417.2128 1428.3537 1440.2631 1464.5446 1466.7234 1468.5991 1477.7740 1479.5048 1481.8450 1483.5348 1483.9447 1489.5657 1593.1009 1614.1658 1625.6140 2965.7823 2972.2926 2974.5614 2980.3431 2981.4094 2988.4084 3009.5610 3028.7352 3033.3789 3043.8236 3050.8766 3060.7935 3073.9776 3093.6128 3112.4848 3113.9222 3119.3653 3121.9775 3130.4339 3141.9536 3161.2090
redmass: 4.4507 3.7442 3.6439 3.9642 4.1637 3.0651 6.8951 2.6614 1.2099 2.5524 1.8277 1.7288 3.7230 3.4195 2.3281 1.9395 3.4938 2.3456 3.5009 3.6813 4.3021 2.8232 3.9917 4.9373 3.3549 4.3830 7.2454 7.2375 6.3704 4.9040 1.7205 1.0729 1.1956 1.9837 1.1980 3.7976 1.2472 3.0356 1.5728 1.4682 1.3867 1.7307 6.2677 1.3381 3.9447 2.1867 1.6004 4.4755 1.3497 2.3724 2.2480 1.8866 1.5969 1.3100 1.3717 1.0520 1.1130 2.3503 2.5775 1.3114 1.8537 1.2185 1.2371 1.2427 1.0739 1.3684 1.2525 1.4126 1.5088 2.0321 7.9157 1.2091 1.1823 1.0961 2.1783 1.0413 1.0751 1.1001 1.1056 1.0469 1.1010 1.9591 1.1197 1.0988 6.0520 6.1794 8.0553 1.0590 1.0496 1.0467 1.0593 1.0374 1.0611 1.0975 1.1004 1.0592 1.1045 1.1019 1.1052 1.0961 1.1011 1.0871 1.0868 1.1058 1.0978 1.0906 1.0958 1.1014
irintensity: 0.1872 0.0168 0.1030 0.1718 1.1043 0.7777 4.3921 0.1900 0.2055 0.3138 0.6499 4.0882 2.2018 2.5843 0.8519 2.1042 6.6747 0.0576 0.6818 17.2205 6.0063 0.0088 10.6823 3.6814 13.1354 6.8783 7.6484 9.2805 0.3113 24.7189 56.1226 7.6683 4.8619 43.1913 1.1798 2.7901 0.0167 12.0012 15.6361 2.8460 0.0130 40.1956 0.0374 0.2398 2.4432 8.5933 11.1234 3.9471 7.6009 17.1352 63.6095 42.5007 19.0150 2.2320 98.2997 0.1844 0.1707 0.1941 40.5025 11.9547 5.0154 3.9671 24.9083 2.8994 2.2187 0.7464 0.0018 2.0211 23.9816 73.3448 0.0868 19.5438 67.0700 22.8846 6.5754 13.0437 1.8175 2.9335 1.9718 9.3946 6.0632 23.6932 7.9307 30.0673 1.4665 18.7699 332.3676 3.0256 15.3653 49.3592 43.9538 38.5605 66.6981 2.4101 1.3080 20.2847 8.5934 35.4118 74.5602 36.7735 8.0922 9.4057 9.3587 13.8018 3.2187 10.2181 46.1411 25.1049
temp: 298.150 k
press: 1.00000 atm
elementType: 16 8 7 6 6 6 6 6 6 6 6 6 6 6 6 6 6 1 1 1 1 1 1 1 1 1 1 1 1 1 1 1 1 1 1 1 1 1
symmnumber: 1
zpe: 842155.6 jmol-1
zpe.correction: 0.320760 hartree
zpe.thermalcorrener: 0.340153 hartree
zpe.thermalcorrenthalpy: 0.341097 hartree
zpe.thermalcorrgfe: 0.268275 hartree
zpe.sumelectzpe: -1072.831724 hartree
zpe.sumelectthermal: -1072.812331 hartree
zpe.sumelectthermalent: -1072.811387 hartree
zpe.sumelectthermalfe: -1072.884209 hartree
dipole: -2.0693 0.9143 -0.1429
dipole: 2.2668
quadrupole: -122.3262 -97.8466 -114.2001
quadrupole: -6.0100 1.8118 1.0796
quadrupole: -10.8686 13.6111 -2.7425 -6.0100 1.8118 1.0796
hfenergy: -1073.152484 hartree
pointgroup: C01 [X(C14H21N1O1S1)]
dipole: -0.8002583 -0.3929949 0.0225465 debye
polarizability: 227.9835676|16.5002002|189.1119345|-20.1625084|15.6969332|117.8109744 unknown
InChI: InChI=1S/C14H21NOS/c1-3-17-14(16)15(2)12-8-7-11-13-9-5-4-6-10-13/h4-6,9-10H,3,7-8,11-12H2,1-2H3
charge 0 multiplicity 1
38 atoms
S  3.290387 1.263898 0.910369
O  5.02713 -0.603765 -0.157349
N  2.870675 -1.395868 0.295098
C  0.524853 -0.692234 -0.351991
C  -0.914176 -0.504134 0.175153
C  1.488113 -1.159066 0.765181
C  -1.895353 -0.02055 -0.929071
C  -3.313023 0.159244 -0.405301
C  3.188882 -2.743051 -0.218628
C  -4.243245 -0.911742 -0.441118
C  -3.722297 1.387659 0.175877
C  3.850226 -0.424477 0.259845
C  -5.544424 -0.763037 0.090351
C  -5.022002 1.542433 0.708695
C  -5.938528 0.46592 0.668724
C  4.921645 2.183705 0.611841
C  5.030436 2.739085 -0.813605
H  0.525304 -1.433536 -1.176759
H  0.900309 0.260871 -0.771772
H  -0.916575 0.231109 1.005055
H  -1.291464 -1.456842 0.599905
H  1.501645 -0.414933 1.582858
H  1.119873 -2.107889 1.201916
H  -1.515827 0.934587 -1.342111
H  -1.885228 -0.755622 -1.757967
H  4.219816 -2.739147 -0.602877
H  3.106555 -3.493962 0.589886
H  2.497238 -3.020927 -1.035796
H  -3.946103 -1.866428 -0.89387
H  -3.018131 2.229027 0.205502
H  -6.250588 -1.600442 0.049809
H  -5.321276 2.500277 1.149636
H  -6.947942 0.584749 1.078391
H  5.718935 1.450959 0.816786
H  4.934101 2.974792 1.380338
H  5.023259 1.914728 -1.546483
H  4.199787 3.428166 -1.046788
H  5.982111 3.293042 -0.931129
