program: Gaussian 09
title: 000185209
version: EM64L-G09RevD.01
frameworkgroup: C1[X(C16H18O3)]
method: RPBEPBE
basis: SDD
operation: Freq
keyword: #pfreq=noraman
keyword: PBEPBE/SDD
title: #p freq=noraman PBEPBE/SDD
converged: YES YES NO NO
title: Mulliken charges:
elementType: O O O C C C C C C C C C C C C C C C C H H H H H H H H H H H H H H H H H H
charge: -0.205475 -0.439495 -0.269776 0.195795 0.052943 -0.746501 -0.712211 -0.724437 0.249954 -0.023398 0.340620 0.194788 -0.355871 -0.436711 0.197425 -0.419672 -0.400355 -0.267592 -0.532447 0.213005 0.207437 0.260506 0.209734 0.250612 0.206579 0.231315 0.209379 0.254919 0.264826 0.274832 0.190492 0.244080 0.227173 0.360923 0.223866 0.224693 0.248044
chargesum: 0.00000
title: Mulliken charges with hydrogens summed into heavy atoms:
elementType: O O O C C C C C C C C C C C C C C C C
charge: -0.205475 -0.078572 -0.269776 0.195795 0.052943 -0.065552 -0.045286 -0.028824 0.249954 -0.023398 0.340620 0.194788 -0.091045 -0.161879 0.197425 -0.229180 -0.156275 -0.040419 0.164157
polarizability: 2.82896446e+02 1.17408853e+01 1.94682435e+02 9.25615193e+00 5.68834879e-01 1.06760607e+02
1716.lowfreq: -9.5901 0.0005 0.0007 0.0010 3.5694 6.5213 29.3223 53.3066 61.5062
frequency: 28.9057 53.2961 61.5004 83.2497 114.0183 129.3721 163.2817 176.0458 185.7254 199.1445 229.0380 237.7048 240.5249 249.3638 260.0816 267.5759 291.6134 303.1583 334.0852 347.3578 353.6891 371.5212 377.4457 449.1459 478.1289 496.8923 512.4243 539.2894 556.5560 568.5882 593.9603 623.8501 662.8824 688.3040 723.2600 757.1808 790.3915 805.0018 812.6924 846.0594 853.2518 863.2689 880.4155 928.0837 936.7311 949.5141 951.9597 976.4731 981.5888 1014.8359 1023.9986 1038.0855 1085.2313 1113.9564 1144.1369 1155.0050 1167.3539 1194.2432 1196.8122 1202.6601 1232.8309 1238.5910 1243.8382 1254.4786 1265.2296 1351.6625 1359.4007 1371.1153 1390.5017 1396.2184 1423.3579 1431.4418 1447.2687 1451.5115 1461.1016 1466.1153 1467.9207 1469.3899 1472.4858 1476.8230 1486.6134 1502.0487 1506.9862 1559.1043 1584.6124 1596.2678 1631.1850 2964.2211 2978.7267 2979.4496 2983.9205 3054.0542 3065.0532 3072.4315 3076.7907 3101.7950 3102.5151 3104.5464 3108.4000 3129.8371 3146.5635 3155.9087 3172.0081 3186.1800 3579.3749
redmass: 4.4149 4.2677 3.3858 3.5393 4.3380 4.4939 2.6813 1.4460 1.8995 3.0484 2.1142 1.6097 1.6669 1.2549 2.6054 1.3480 3.0708 2.4561 2.5712 3.1290 3.5397 4.3349 2.3866 3.4649 5.4968 4.1378 7.5008 4.7119 4.6798 4.0995 3.6394 5.6941 5.6999 4.3555 1.6465 2.8675 4.0924 5.1472 4.3236 1.6570 1.5066 4.1651 4.8359 1.7752 1.5947 1.3304 1.2020 2.5129 1.5672 1.8122 1.8247 2.0802 2.0624 1.2600 2.4783 1.3836 1.2854 2.5530 2.5298 1.3892 3.0770 2.3773 1.9463 1.9472 3.4605 3.4376 1.1875 1.1993 2.5694 1.2386 2.2185 3.7038 1.7097 1.0520 2.6611 1.0596 1.0498 1.0534 1.0801 1.0654 1.0554 1.0843 3.6642 9.2263 7.7648 6.0467 7.0036 1.0328 1.0359 1.0351 1.0367 1.1041 1.0995 1.0997 1.0989 1.0995 1.0877 1.0994 1.0977 1.0998 1.0914 1.0889 1.0953 1.0957 1.0653
irintensity: 2.6054 0.8065 1.8095 1.4908 1.8023 1.9841 1.2141 4.0303 3.8854 3.0452 0.4407 9.4284 6.6028 19.9623 7.7902 4.6588 13.2178 25.1774 28.4532 3.7975 1.4528 7.2216 0.4900 5.0521 1.8556 3.1204 4.8639 2.5348 5.9508 20.5713 4.8092 6.9651 2.6185 9.3490 33.2886 58.8365 6.4360 13.5216 8.6513 39.0270 0.8659 20.8581 17.0546 4.4024 4.3435 0.9630 0.9326 25.6961 21.1053 36.2664 78.7570 191.2111 11.8039 0.1238 42.4029 4.7098 79.0146 23.5064 27.0096 1.3282 11.2507 131.1763 28.5732 6.5062 45.7163 196.7724 14.8209 29.0080 11.8919 29.4650 35.4170 0.3833 18.1852 2.4660 11.6225 3.9342 14.2305 3.3085 52.7059 10.3748 8.7750 54.6479 81.5366 133.1003 27.4953 25.0832 12.6643 74.1265 16.7603 38.7477 54.1746 43.4260 14.6403 43.4884 48.5067 10.4503 11.8664 12.1173 23.5222 19.9356 19.1697 1.2304 16.6369 2.1676 22.8216
temp: 298.150 k
press: 1.00000 atm
elementType: 8 8 8 6 6 6 6 6 6 6 6 6 6 6 6 6 6 6 6 1 1 1 1 1 1 1 1 1 1 1 1 1 1 1 1 1 1
symmnumber: 1
zpe: 784270.5 jmol-1
zpe.correction: 0.298713 hartree
zpe.thermalcorrener: 0.317611 hartree
zpe.thermalcorrenthalpy: 0.318556 hartree
zpe.thermalcorrgfe: 0.252483 hartree
zpe.sumelectzpe: -844.769029 hartree
zpe.sumelectthermal: -844.750130 hartree
zpe.sumelectthermalent: -844.749186 hartree
zpe.sumelectthermalfe: -844.815259 hartree
dipole: 5.0420 3.0066 1.7989
dipole: 6.1398
quadrupole: -90.9493 -104.7641 -119.7095
quadrupole: -5.6094 -4.0368 -5.6905
quadrupole: 14.1917 0.3769 -14.5686 -5.6094 -4.0368 -5.6905
hfenergy: -845.0677415 hartree
pointgroup: C01 [X(C16H18O3)]
dipole: 2.0159129 -0.7369702 -1.1081509 debye
polarizability: 283.1630426|-2.0297742|181.988472|-15.8070353|29.684366|119.1879738 unknown
InChI: InChI=1S/C16H18O3/c1-16(2,3)15(18)12-9-8-10-11(14(12)17)6-5-7-13(10)19-4/h5-9,17H,1-4H3
charge 0 multiplicity 1
37 atoms
O  -3.025308 1.113946 1.668715
O  -1.219492 -1.804695 -0.368324
O  3.726757 1.804867 0.158909
C  -3.744569 0.186519 -0.471754
C  -2.664564 0.595911 0.570353
C  -3.195788 0.072904 -1.915526
C  -4.857229 1.275561 -0.434727
C  -4.360154 -1.171179 -0.009947
C  -1.176146 0.508432 0.302299
C  -0.481048 -0.627337 -0.145459
C  0.950765 -0.619802 -0.335005
C  1.675087 0.586075 -0.008602
C  -0.413163 1.677871 0.638382
C  0.969295 1.727358 0.485198
C  3.108535 0.59718 -0.183952
C  1.667484 -1.757811 -0.839752
C  3.789351 -0.530119 -0.662453
C  3.05304 -1.706633 -0.993458
C  5.181975 1.892068 0.01331
H  -2.696113 1.007453 -2.231691
H  -4.038961 -0.10867 -2.608178
H  -2.484701 -0.761603 -2.020011
H  -4.479359 2.24737 -0.80379
H  -5.227904 1.419679 0.593285
H  -5.697803 0.9642 -1.081836
H  -4.792453 -1.072116 1.001737
H  -5.16638 -1.462065 -0.709483
H  -3.59788 -1.967257 0.001813
H  -0.961082 2.535941 1.039722
H  1.533782 2.626581 0.741095
H  1.147679 -2.675161 -1.144545
H  4.874669 -0.524587 -0.794152
H  3.591147 -2.576189 -1.3853
H  -0.62101 -2.585264 -0.470378
H  5.487906 1.740901 -1.039923
H  5.693369 1.153674 0.660485
H  5.441264 2.911301 0.334044
