program: Gaussian 09
title: 000185208
version: EM64L-G09RevD.01
frameworkgroup: C1[X(C18H16O3)]
method: RPBEPBE
basis: SDD
operation: Freq
keyword: #pfreq=noraman
keyword: PBEPBE/SDD
title: #p freq=noraman PBEPBE/SDD
converged: YES YES NO NO
title: Mulliken charges:
elementType: O O O C C C C C C C C C C C C C C C C C C H H H H H H H H H H H H H H H H
charge: -0.257867 -0.268546 -0.255707 -0.536586 -0.569243 0.384411 0.504282 0.186998 0.176210 -0.462112 0.145884 -0.375025 -0.411657 -0.356353 -0.357330 -0.355982 -0.353576 0.319283 -0.248374 -0.207945 -0.538634 0.241484 0.231372 0.227202 0.222188 0.259963 0.228200 0.234827 0.280116 0.264750 0.248177 0.240965 0.235313 0.235953 0.221586 0.244540 0.221233
chargesum: 0.00000
title: Mulliken charges with hydrogens summed into heavy atoms:
elementType: O O O C C C C C C C C C C C C C C C C C C
charge: -0.257867 -0.268546 -0.255707 -0.063730 -0.119854 0.384411 0.504282 0.186998 0.176210 -0.202149 0.145884 -0.146825 -0.176830 -0.076237 -0.092580 -0.107805 -0.112611 0.319283 -0.013061 0.028008 0.148726
polarizability: 1.98992984e+02 7.61881305e+00 2.36040663e+02 -4.17820251e+01 -2.10044230e+00 1.61280587e+02
1716.lowfreq: -6.0276 -4.7482 -0.0002 0.0003 0.0007 12.3895 17.1424 19.9265 26.8139
frequency: 15.2277 19.1353 26.6036 62.1703 79.5794 100.9754 122.0343 155.0791 167.7446 210.8721 226.9476 249.4918 261.5672 304.4385 304.6897 342.8179 385.5847 412.6529 421.1366 427.2300 449.4581 471.2518 503.4421 519.9293 526.1991 542.7700 558.1641 625.9489 633.6738 661.0974 672.0271 684.5512 728.9781 731.9364 761.1026 783.5911 793.9412 808.9696 818.1122 832.5055 871.5551 883.7685 888.6550 921.0802 945.1408 955.6921 961.1597 971.4723 988.6801 999.4085 1000.5545 1005.9178 1021.7460 1073.4328 1106.9948 1112.5452 1118.5978 1147.6701 1153.9268 1156.9037 1163.2087 1180.7823 1193.2510 1196.0190 1220.0927 1230.7129 1247.8305 1277.8940 1300.2938 1312.9652 1335.8402 1355.5393 1385.1983 1399.0541 1419.5000 1436.7721 1445.7623 1455.4626 1460.9952 1466.3264 1469.5792 1473.4885 1504.0491 1555.9645 1574.9129 1586.2208 1620.3817 1625.7654 1631.2843 2958.4546 2987.7753 3009.1320 3045.7759 3047.6356 3076.4313 3116.9923 3122.4823 3124.3092 3138.2888 3151.2064 3161.4775 3164.8175 3165.1333 3170.8500 3176.1788
redmass: 6.0455 6.4314 3.4480 4.7476 4.3777 4.3090 5.2217 5.3830 4.3501 2.6911 1.6374 2.6457 3.2902 4.4738 4.0665 2.3284 4.6540 3.0996 4.7190 3.5816 4.2205 6.0024 3.6776 4.8514 4.9719 2.7354 5.3243 5.8638 6.5173 4.2197 3.2721 3.8802 3.2032 4.9183 2.4394 1.5173 4.8568 2.2593 1.6897 1.7736 1.4353 1.5296 3.1633 2.2532 1.8172 2.3648 1.3579 1.3692 8.1437 2.4674 1.3338 2.6305 2.1321 3.4160 1.4067 1.2604 1.8590 1.1582 2.2174 1.2999 1.2749 1.2577 1.3434 2.3138 1.7694 4.1036 1.7535 1.4753 1.4557 1.4693 1.5168 2.5498 4.8080 9.7581 3.2847 1.1698 2.5152 1.2088 2.3344 1.0502 1.1134 1.0731 2.5323 9.6948 7.3799 6.9764 7.1085 6.4863 7.6794 1.0330 1.0602 1.0604 1.1039 1.1020 1.1025 1.0896 1.0913 1.0974 1.0860 1.0902 1.0936 1.0958 1.0950 1.0925 1.0997
irintensity: 1.0102 1.3335 1.3848 1.6551 0.8879 0.7699 6.3984 1.3688 1.4434 3.2114 0.9520 0.3652 3.1257 0.0408 4.9305 0.7306 3.4292 0.4856 1.2272 1.4952 0.6330 1.1321 10.7135 0.7857 6.5768 11.2723 13.5521 5.2765 0.4171 8.7998 1.5537 10.7146 0.9182 1.7774 32.4978 63.5502 3.5946 46.2091 3.0442 33.9618 20.1730 2.6024 21.3981 12.5724 9.4286 16.0106 0.6580 2.7650 33.7696 5.6112 0.4156 3.4206 9.4226 5.1754 6.8459 0.2145 26.6295 2.2917 40.4133 0.2366 2.8158 50.6680 0.5151 32.5454 13.5119 160.2899 5.4652 1.4877 17.5932 18.9627 15.5458 149.0003 9.7981 11.5636 3.2350 7.6771 61.1391 9.5042 0.7224 12.9904 11.3509 47.8280 107.8811 131.4521 1.6718 10.0473 32.4104 59.4043 249.3623 60.7009 35.7265 26.6961 48.0789 18.6068 18.0051 15.4364 34.6291 6.6245 3.8185 4.1497 13.5757 14.4774 3.7097 3.6406 12.8977
temp: 298.150 k
press: 1.00000 atm
elementType: 8 8 8 6 6 6 6 6 6 6 6 6 6 6 6 6 6 6 6 6 6 1 1 1 1 1 1 1 1 1 1 1 1 1 1 1 1
symmnumber: 1
zpe: 764596.9 jmol-1
zpe.correction: 0.291220 hartree
zpe.thermalcorrener: 0.309276 hartree
zpe.thermalcorrenthalpy: 0.310220 hartree
zpe.thermalcorrgfe: 0.242480 hartree
zpe.sumelectzpe: -919.690456 hartree
zpe.sumelectthermal: -919.672400 hartree
zpe.sumelectthermalent: -919.671456 hartree
zpe.sumelectthermalfe: -919.739195 hartree
dipole: 2.8952 1.3184 -1.5237
dipole: 3.5273
quadrupole: -140.5912 -100.0893 -121.9525
quadrupole: -3.9609 12.2758 6.9441
quadrupole: -19.7135 20.7884 -1.0749 -3.9609 12.2758 6.9441
hfenergy: -919.981676 hartree
pointgroup: C01 [X(C18H16O3)]
dipole: 1.1175504 0.595582 -0.5676621 debye
polarizability: 199.8537722|6.1009561|236.9474272|-40.7176889|-3.2323555|159.5130349 unknown
InChI: InChI=1S/C18H16O3/c1-20-14-9-6-13(7-10-14)8-11-15-12-17(19)16-4-2-3-5-18(16)21-15/h2-7,9-10,12H,8,11H2,1H3
charge 0 multiplicity 1
37 atoms
O  -0.917836 -0.579743 -1.153381
O  4.228829 2.008582 0.175849
O  -3.861953 -1.114115 1.778252
C  -0.043247 -2.813481 -0.936814
C  1.188008 -2.894962 0.031413
C  -1.07166 -1.805688 -0.493892
C  1.990093 -1.605803 0.113068
C  -2.778896 0.354771 0.175507
C  -1.76715 0.49373 -0.809789
C  -2.037849 -1.997673 0.466581
C  -2.967527 -0.943736 0.883796
C  2.901539 -1.250706 -0.918785
C  1.838132 -0.712298 1.198702
C  -3.596288 1.480031 0.461288
C  -1.553969 1.705732 -1.500856
C  3.627966 -0.048279 -0.871682
C  2.5582 0.503534 1.266774
C  3.456127 0.836289 0.223706
C  -3.401379 2.694984 -0.216726
C  -2.377483 2.806039 -1.19831
C  4.093747 2.949986 1.289318
H  0.30382 -2.546325 -1.950808
H  -0.515954 -3.81137 -0.989452
H  0.823345 -3.182483 1.035034
H  1.82994 -3.722095 -0.328853
H  -2.125564 -2.975733 0.947718
H  3.047472 -1.928278 -1.769728
H  1.144995 -0.964506 2.010878
H  -4.373856 1.356827 1.222616
H  -0.75628 1.765378 -2.246754
H  4.334562 0.226564 -1.660872
H  2.412541 1.16711 2.124445
H  -4.0359 3.558645 0.007475
H  -2.225186 3.754264 -1.724896
H  3.05694 3.330651 1.372756
H  4.774933 3.779471 1.049056
H  4.395484 2.485683 2.248566
