program: Gaussian 09
title: 000185205
version: EM64L-G09RevD.01
frameworkgroup: C1[X(C16H11BrO2)]
method: RPBEPBE
basis: SDD
operation: Freq
keyword: #p
keyword: freq=noraman
keyword: PBEPBE/SDD
title: #p freq=noraman PBEPBE/SDD
converged: NO NO NO NO
title: Mulliken charges:
elementType: Br O O C C C C C C C C C C C C C C C C H H H H H H H H H H H
charge: 0.015382 -0.242997 -0.166671 0.272843 0.273216 -0.073620 0.153809 0.285893 0.068785 -0.819322 -0.288442 -0.341200 -0.369987 -0.370019 -0.273193 -0.176036 -0.219883 -0.219878 -0.238151 0.241963 0.241988 0.271405 0.270612 0.273745 0.240177 0.240169 0.258961 0.229758 0.229762 0.230931
chargesum: 0.00000
title: Mulliken charges with hydrogens summed into heavy atoms:
elementType: Br O O C C C C C C C C C C C C C C C C
charge: 0.015382 -0.242997 -0.166671 0.272843 0.273216 -0.073620 0.153809 0.285893 0.068785 -0.063966 -0.017830 -0.067455 -0.129810 -0.129850 -0.273193 0.082925 0.009876 0.009884 -0.007220
polarizability: 3.29870943e+02 2.89918526e+00 1.66030831e+02 -1.97455004e-02 -2.37859522e-02 1.16061797e+02
1716.lowfreq: -34.3493 -0.0007 -0.0007 -0.0004 1.5902 5.4971 5.7498 39.8563 55.1249
frequency: -34.0628 39.8176 55.1201 57.3905 135.3885 135.6307 153.3609 158.0838 185.2603 210.6622 253.6937 260.9029 322.0131 325.6886 364.5376 387.8184 396.2815 458.3361 476.5381 495.3246 527.3062 527.8081 543.9165 592.0665 610.7582 615.0275 662.0174 676.5187 702.7326 722.0621 753.1138 759.0313 819.0996 826.9568 846.0412 851.7094 871.9645 888.0563 924.8190 959.0611 974.7527 988.2618 996.9454 1003.9039 1032.4985 1037.8023 1050.7282 1072.3923 1079.4841 1108.6973 1139.0005 1173.7647 1188.1305 1220.9101 1249.7609 1276.4227 1310.5975 1334.6677 1369.9584 1393.0902 1398.1899 1401.2521 1429.4937 1459.9005 1468.6624 1474.8495 1482.3460 1550.9607 1585.3730 1596.0478 1601.4716 1614.8124 1668.1640 2981.2933 3052.9622 3124.4796 3126.3742 3128.8457 3140.2166 3150.7469 3164.5281 3165.9872 3179.2473 3183.7640
redmass: 3.9787 4.7254 8.4673 6.5674 5.2471 7.7994 3.3315 6.1594 1.1025 8.7958 10.7156 4.4889 3.7218 7.4118 5.4010 3.8736 2.8251 7.1245 3.8324 4.1110 4.7864 7.2666 6.9438 4.2680 4.6847 6.5388 7.4522 6.9763 1.7371 5.3070 5.3748 2.0721 4.7601 1.4482 4.5468 1.2472 8.0897 1.4442 1.4710 1.3398 1.3889 5.7922 1.3423 2.7678 1.9353 1.5656 4.8109 2.2494 1.6004 2.7598 1.4480 1.0529 1.1133 4.2858 2.2481 1.7102 1.3661 3.7574 6.9408 3.9701 2.7434 1.8729 2.1991 1.3206 2.3349 1.0468 2.2345 6.7959 6.0208 7.2048 7.4611 6.5055 12.6688 1.0402 1.0967 1.0851 1.0958 1.0880 1.0925 1.0968 1.0888 1.1018 1.0923 1.0975
irintensity: 0.1101 0.0899 2.3687 0.4920 0.0185 1.1973 0.5429 0.2625 1.6046 1.5019 1.4398 1.3605 1.4915 1.3365 0.9058 0.2522 0.0183 3.1753 7.9986 16.7901 0.3692 0.6006 18.0268 11.5841 21.0079 0.6325 19.1572 5.0701 58.0029 1.1947 3.9446 38.4113 8.9922 49.3234 165.8103 0.0000 20.2281 11.3405 9.6906 1.1573 0.0041 3.7854 0.1615 1.0596 5.4820 0.5177 40.6310 16.4578 10.1493 10.0315 10.3262 0.0100 2.1428 30.0293 3.1689 60.1450 0.3808 37.2893 0.0644 16.4837 13.2606 73.2182 8.5721 32.5150 31.0587 8.0522 15.4693 59.6885 1.5646 11.3574 23.3180 2.6606 499.3028 12.5004 8.2302 4.2461 8.6152 0.0568 13.9951 34.7343 0.2447 27.2597 1.1583 1.2215
temp: 298.150 k
press: 1.00000 atm
elementType: 35 8 8 6 6 6 6 6 6 6 6 6 6 6 6 6 6 6 6 1 1 1 1 1 1 1 1 1 1 1
symmnumber: 1
zpe: 578296.7 jmol-1
zpe.correction: 0.220262 hartree
zpe.thermalcorrener: 0.235501 hartree
zpe.thermalcorrenthalpy: 0.236445 hartree
zpe.thermalcorrgfe: 0.176527 hartree
zpe.sumelectzpe: -778.915108 hartree
zpe.sumelectthermal: -778.899869 hartree
zpe.sumelectthermalent: -778.898925 hartree
zpe.sumelectthermalfe: -778.958843 hartree
dipole: -0.6572 -3.7687 -0.0025
dipole: 3.8256
quadrupole: -116.8739 -124.6511 -114.5280
quadrupole: -19.7393 -0.0157 -0.0171
quadrupole: 1.8104 -5.9667 4.1563 -19.7393 -0.0157 -0.0171
hfenergy: -779.1353699 hartree
pointgroup: C01 [X(C16H11Br1O2)]
dipole: -0.0322749 1.5047601 -0.0002588 debye
polarizability: 325.290543|-27.1638051|170.6111232|0.0832911|-0.0777409|116.0619047 unknown
InChI: InChI=1S/C16H11BrO2/c1-10-13-9-12(17)7-8-14(13)19-16(18)15(10)11-5-3-2-4-6-11/h2-9H,1H3
charge 0 multiplicity 1
30 atoms
Br -5.509858 2.049675 -0.002414
O  -0.931913 -2.046658 0.001161
O  1.294071 -2.619828 0.001586
C  -0.221865 0.729541 0.000086
C  -1.625464 0.311258 -0.000154
C  0.781789 -0.233827 0.000857
C  -1.932901 -1.08043 0.000284
C  2.243415 0.112858 0.000722
C  0.483008 -1.67785 0.001932
C  0.099319 2.20868 -0.000578
C  -2.711329 1.233977 -0.000964
C  -3.265055 -1.547603 -0.000072
C  2.944749 0.267793 1.223223
C  2.944045 0.26995 -1.221914
C  -4.030171 0.761372 -0.00128
C  -4.325845 -0.624381 -0.000846
C  4.320659 0.588648 1.223068
C  4.319965 0.590782 -1.221995
C  5.011919 0.75287 0.000481
H  -0.332106 2.704278 -0.891036
H  -0.332526 2.705148 0.889196
H  1.184278 2.38255 -0.000408
H  -2.515164 2.308515 -0.001354
H  -3.449819 -2.625302 0.000294
H  2.413686 0.131504 2.172369
H  2.41242 0.135344 -2.170988
H  -5.36243 -0.971924 -0.001119
H  4.851606 0.704971 2.174444
H  4.850369 0.708752 -2.173472
H  6.079747 0.998639 0.00039
