program: Gaussian 09
title: 000185203
version: EM64L-G09RevD.01
frameworkgroup: C1[X(C12H9Br2NO2)]
method: RPBEPBE
basis: SDD
operation: Freq
keyword: #p
keyword: freq=noraman
keyword: PBEPBE/SDD
title: #p freq=noraman PBEPBE/SDD
converged: YES YES NO NO
title: Mulliken charges:
elementType: Br Br O O N C C C C C C C C C C C C H H H H H H H H H
charge: 0.128012 0.128031 -0.170376 -0.170370 -0.210695 -0.376998 -0.562075 0.496295 0.267524 0.267700 -0.226670 -0.226769 -0.403596 -0.403178 -0.225100 -0.225226 -0.239479 0.260716 0.260684 0.233778 0.234007 0.239811 0.239808 0.226998 0.227005 0.230159
chargesum: 0.00000
title: Mulliken charges with hydrogens summed into heavy atoms:
elementType: Br Br O O N C C C C C C C C C C C C
charge: 0.128012 0.128031 -0.170376 -0.170370 -0.210695 0.144402 -0.094289 0.496295 0.267524 0.267700 -0.226670 -0.226769 -0.163784 -0.163370 0.001899 0.001779 -0.009320
polarizability: 2.37755171e+02 1.81684869e-02 2.05254647e+02 -1.67945497e+01 -9.91472624e-03 7.56656889e+01
1716.lowfreq: -6.5507 -0.0004 -0.0002 0.0003 2.0586 2.7062 18.8038 21.6366 33.5023
frequency: 18.3317 20.7809 33.5011 41.5617 77.7964 83.8698 101.3513 131.5540 165.4428 192.7388 238.3419 252.5600 279.8377 305.3761 332.0218 345.7299 404.0584 438.2455 445.1816 501.9717 568.1629 617.2084 619.9967 683.7548 706.1528 718.7863 733.4519 758.2305 774.0008 801.7401 803.3742 851.1618 856.9606 922.7190 973.4583 979.6121 990.3344 996.2718 1023.4970 1027.4509 1057.3473 1085.1566 1104.6407 1115.6699 1173.3697 1188.4644 1218.2025 1240.7198 1298.0969 1325.1418 1329.9983 1332.9957 1371.6817 1383.0023 1441.9156 1454.0973 1481.6795 1485.2777 1576.3982 1594.1713 1614.7206 1629.1684 1681.6055 3003.2355 3029.1127 3059.7679 3098.1709 3117.7177 3117.8208 3133.9731 3146.3880 3164.4535
redmass: 5.2365 4.9112 8.3257 3.4119 19.5516 7.3147 16.5176 10.0562 7.8310 11.6806 5.6205 2.7391 15.3933 19.3113 5.7403 2.5908 2.8276 8.6550 12.2795 3.2525 7.4715 6.3734 7.1436 5.4455 1.8059 11.6639 11.8461 1.8542 2.1556 5.8127 2.5481 4.2167 1.2464 1.4943 2.3076 1.4087 6.3064 1.3243 3.7837 2.5128 1.8717 8.9175 2.0003 3.6526 1.0527 1.1207 2.4812 1.6060 1.3803 1.2884 5.2879 1.1972 1.4427 8.0194 2.1695 1.1041 1.3877 1.6189 11.9981 6.0662 6.1430 12.6444 11.7852 1.0593 1.0588 1.1036 1.1068 1.0877 1.0872 1.0907 1.0958 1.1015
irintensity: 0.0074 0.0083 0.3471 0.0276 0.0012 0.0237 0.3901 5.5994 0.1335 0.8923 3.5552 1.2292 0.4710 0.0000 8.3520 0.6541 0.0014 29.6025 0.0101 19.7211 1.0164 0.0340 8.6569 0.0307 51.5863 29.0582 0.0369 40.8496 11.4032 8.1244 49.8900 3.2732 0.0921 1.7186 38.4222 2.1474 0.3086 0.0191 3.6463 12.6052 9.2642 8.5802 100.6452 36.9002 0.0830 0.2388 1.2747 0.0195 1.3846 1.8038 404.1292 0.6530 42.8564 0.0863 6.2762 25.9013 20.8931 10.3193 153.7299 4.3585 6.3708 391.0546 11.4674 16.8614 22.0971 5.0960 2.7167 6.0849 7.7861 9.3842 36.3765 24.4447
temp: 298.150 k
press: 1.00000 atm
elementType: 35 35 8 8 7 6 6 6 6 6 6 6 6 6 6 6 6 1 1 1 1 1 1 1 1 1
symmnumber: 1
zpe: 477733.1 jmol-1
zpe.correction: 0.181959 hartree
zpe.thermalcorrener: 0.198031 hartree
zpe.thermalcorrenthalpy: 0.198975 hartree
zpe.thermalcorrgfe: 0.132982 hartree
zpe.sumelectzpe: -693.585950 hartree
zpe.sumelectthermal: -693.569878 hartree
zpe.sumelectthermalent: -693.568933 hartree
zpe.sumelectthermalfe: -693.634927 hartree
dipole: -0.5545 0.0000 -0.1033
dipole: 0.5640
quadrupole: -100.0366 -123.2841 -118.0418
quadrupole: 0.0012 -2.8291 -0.0036
quadrupole: 13.7509 -9.4966 -4.2543 0.0012 -2.8291 -0.0036
hfenergy: -693.7679086 hartree
pointgroup: C01 [X(C12H9Br2N1O2)]
dipole: 0.2191831 -0.0000031 -0.0346354 debye
dipolederiv: -0.3522898 -0.3997604 -0.0692313 -0.3248154 -0.2350913 -0.052031 -0.0855083 -0.0755346 0.0767937 -0.3515282 0.4007177 -0.0652526 0.3259333 -0.2370878 0.0491149 -0.0821037 0.0721954 0.0783195 -0.570777 0.2901372 -0.0386702 0.0414559 -0.9387681 0.0369147 -0.0236302 0.0580269 -0.3042107 -0.5710691 -0.2902299 -0.0414655 -0.0410864 -0.9373099 -0.0429155 -0.023892 -0.0643053 -0.3052633 -1.4816126 0.0005663 -0.0814418 0.0009056 -0.839179 -0.0028546 -0.0921365 -0.0030995 -0.2269359 0.8684426 -0.0001451 -0.0105668 -0.0000324 0.0955235 -0.0002907 -0.088166 0.00018 0.214338 -0.152285 0.0002848 -0.0096106 -0.0007412 0.1167503 0.0004367 0.0990361 0.0004916 0.0673711 0.3848428 -0.0007361 0.0414846 -0.0012433 -0.0169784 0.0004115 0.1394709 0.0002847 -0.0725154 1.2429105 -0.3217518 0.1296607 0.1512367 1.194335 -0.0377218 0.1447642 -0.0631094 0.2978772 1.243109 0.3206215 0.1327111 -0.1534124 1.193062 0.0462054 0.14302 0.0716332 0.2990831 -0.0282326 1.075761 0.036041 0.9971305 0.3071801 0.1561175 0.0179192 0.2001773 -0.1058776 -0.0307479 -1.0757163 0.0253664 -0.9968077 0.3131676 -0.1521671 0.0078688 -0.1954982 -0.1097082 -0.1610994 -0.0527224 0.0257521 -0.0783502 0.0305948 -0.019842 0.0132474 -0.009569 -0.1498482 -0.1605623 0.0529737 0.0264474 0.0789442 0.0298217 0.0217321 0.014192 0.0114679 -0.1494419 -0.0066796 0.0675909 0.0325784 0.0884492 0.0987442 0.01366 0.0279755 0.0150837 -0.1346361 -0.0072216 -0.0673441 0.0317187 -0.0886033 0.0992985 -0.0110449 0.0271026 -0.0125295 -0.1349809 0.0535324 -0.0007687 0.0635714 -0.0003903 -0.0835089 0.0002692 0.0539721 0.0002596 -0.1557786 0.0187523 0.0052209 0.0013261 0.0555076 0.0053898 0.1001514 -0.0011691 0.0303543 0.0370288 0.0180214 -0.0054452 0.0010142 -0.0552583 0.0069412 -0.1008141 -0.0017201 -0.0311309 0.0349527 0.0206319 -0.0325073 -0.0254738 -0.0636711 -0.0352221 -0.1066662 -0.043167 -0.0389615 0.0119477 0.0213098 0.0326501 -0.0245557 0.0640419 -0.0373088 0.1058959 -0.0420048 0.0380069 0.0142355 0.0464607 0.1035198 -0.0323448 0.0976927 -0.0382166 0.017087 -0.0344881 0.0193365 0.1351185 0.045746 -0.1034931 -0.0335846 -0.0976864 -0.037172 -0.0189472 -0.0357644 -0.0211564 0.134599 0.0190947 -0.0837986 -0.0267942 -0.1065313 -0.0712564 -0.0206012 -0.0346065 -0.0188191 0.149451 0.0198818 0.0834274 -0.0257196 0.1065238 -0.0720933 0.0181167 -0.0333499 0.0164001 0.1498729 -0.1286309 0.0009478 -0.0629605 0.0008085 0.0883838 -0.0002166 -0.0668623 -0.0001847 0.1482082 unknown
polarizability: 236.7128019|-0.1113923|205.2515051|21.2112359|0.6345933|76.7111993 unknown
InChI: InChI=1S/C12H9Br2NO2/c13-9-10(14)12(17)15(11(9)16)7-6-8-4-2-1-3-5-8/h1-5H,6-7H2
charge 0 multiplicity 1
26 atoms
Br -4.86623 -1.892466 -0.313654
Br -4.863755 1.908187 -0.294823
O  -1.602316 -2.343715 0.277194
O  -1.599269 2.349353 0.300547
N  -1.228379 0.002179 0.369641
C  0.225343 -0.000139 0.611785
C  1.047029 0.008961 -0.707404
C  2.53917 0.004665 -0.410496
C  -2.016155 -1.165752 0.21044
C  -2.014597 1.17263 0.222058
C  -3.431727 -0.676182 -0.045324
C  -3.430836 0.687457 -0.038555
C  3.24614 1.222553 -0.238543
C  3.241322 -1.217878 -0.252274
C  4.622668 1.220062 0.080486
C  4.617816 -1.224508 0.066695
C  5.313001 -0.004499 0.23516
H  0.465439 -0.901939 1.201436
H  0.4667 0.892586 1.214551
H  0.767378 -0.880087 -1.302073
H  0.769676 0.907646 -1.28848
H  2.71718 2.175827 -0.363847
H  2.708573 -2.167568 -0.388353
H  5.156089 2.169213 0.204405
H  5.147472 -2.177105 0.179837
H  6.380969 -0.007982 0.479989
