program: Gaussian 09
title: 000187770
version: EM64L-G09RevD.01
frameworkgroup: C1[X(C23H25NO)]
method: RPBEPBE
basis: SDD
operation: Freq
keyword: #p
keyword: freq=noraman
keyword: PBEPBE/SDD
title: #p freq=noraman PBEPBE/SDD
converged: YES YES NO NO
title: Mulliken charges:
elementType: O N C C C C C C C C C C C C C C C C C C C C C C C H H H H H H H H H H H H H H H H H H H H H H H H H
charge: -0.311923 -0.299787 0.127983 -0.516300 0.378008 0.363663 -0.397029 -0.426113 -0.414200 -0.349274 -0.388436 -0.478759 -0.537427 -0.244569 -0.225353 -0.236875 -0.240007 0.422634 -0.242771 -0.246980 -0.387491 -0.438034 -0.224465 -0.223531 -0.244185 0.228452 0.210352 0.214625 0.226355 0.246935 0.252243 0.284131 0.260083 0.240247 0.223140 0.196753 0.214957 0.229188 0.228700 0.224520 0.223162 0.226305 0.223274 0.228306 0.225539 0.269830 0.231903 0.222736 0.223544 0.225937
chargesum: 0.00000
title: Mulliken charges with hydrogens summed into heavy atoms:
elementType: O N C C C C C C C C C C C C C C C C C C C C C C C
charge: -0.311923 -0.052852 0.127983 -0.077495 0.378008 0.363663 0.043951 -0.173870 -0.130069 -0.089191 -0.148188 -0.058865 0.135418 -0.020049 -0.002191 -0.010570 -0.016733 0.422634 -0.014464 -0.021441 -0.117662 -0.206131 -0.001730 0.000013 -0.018248
polarizability: 2.84086585e+02 1.76595532e+00 2.73258853e+02 -5.48769484e+00 1.62720977e+01 1.89549777e+02
1716.lowfreq: -4.2320 -0.0006 -0.0006 -0.0003 1.0263 8.3181 15.8918 24.4255 30.1444
frequency: 15.1979 24.3759 30.0708 31.1448 40.1822 53.6501 61.2028 82.0382 101.3400 118.8466 133.2531 154.9411 159.0633 173.9845 211.4765 226.6630 247.6146 265.0445 286.3980 298.3679 320.6240 366.2978 384.4099 398.8462 401.9631 403.4559 407.5219 448.9271 483.7378 505.1807 536.1232 591.9619 615.2380 616.1529 616.8928 624.0520 639.6581 695.0675 703.3082 704.8853 709.0759 715.8694 748.7195 761.7871 772.6606 795.6864 809.5281 854.6155 859.2300 860.1109 874.4014 896.7474 914.6908 931.4564 933.9889 970.2887 979.5739 982.1207 982.3926 989.5328 989.9282 990.0536 996.3906 997.2239 998.5683 1005.4015 1021.4158 1024.8702 1026.4151 1030.5496 1052.0792 1074.2642 1078.7211 1082.5746 1096.2921 1113.4362 1123.1893 1136.4222 1151.2114 1163.8618 1169.4474 1170.8326 1172.2939 1180.2875 1187.3568 1191.6850 1193.7536 1212.1187 1221.6358 1250.9454 1285.7764 1291.2845 1311.1974 1314.2297 1319.4266 1340.0602 1376.5845 1380.4961 1381.4861 1393.6247 1431.9962 1432.9785 1434.9636 1440.1072 1448.4926 1457.3281 1475.3878 1476.6216 1479.1753 1480.2829 1484.3481 1487.0848 1500.3293 1589.5831 1591.0070 1593.8986 1609.1013 1612.4000 1615.0895 2863.8223 2900.7660 2953.2110 2970.9553 2982.9598 3018.9342 3035.9152 3047.3908 3099.8459 3112.5185 3117.0785 3122.2859 3122.3324 3125.6025 3130.6834 3136.1626 3139.1814 3143.8617 3150.2406 3151.3436 3157.4577 3161.8772 3164.2150 3177.6324 3418.5235
redmass: 4.4569 3.7938 4.6899 3.8345 4.0020 4.1168 4.3947 4.4047 2.6475 2.8319 2.0293 2.0768 3.7312 2.8393 4.0137 2.5645 4.0580 3.3406 3.8138 3.5933 3.4050 3.9392 4.2700 3.3185 3.0145 2.9055 2.9788 3.3674 3.1614 3.4561 3.9785 4.9038 6.0282 6.2956 6.3210 4.2929 4.9570 2.3435 2.3922 1.6982 1.7594 1.5072 1.5627 2.0299 1.8708 1.5986 3.7912 1.2777 1.2480 1.2473 1.8117 3.9333 1.3458 1.5055 1.5569 1.9199 1.3928 1.4207 1.3839 5.8093 5.3941 5.6560 1.5389 1.3283 1.3538 3.1661 3.3044 2.3087 2.4807 2.3594 2.2945 2.0582 1.5723 1.9366 2.1204 2.0093 1.2731 4.0138 1.4715 1.2150 1.0605 1.0565 1.0539 1.1120 1.1211 1.3334 2.1767 2.4008 1.9982 1.5822 1.4312 1.1586 1.3837 1.3422 1.3476 1.4107 3.5743 5.7604 6.4377 2.1881 1.5361 1.8606 1.6693 2.1179 1.2130 1.0654 1.3051 1.2447 1.9740 1.5812 1.5866 1.2668 1.0836 6.0909 6.2389 6.1718 6.0418 6.0302 6.1467 1.0710 1.0697 1.0324 1.0862 1.0614 1.0874 1.1025 1.1003 1.0995 1.0866 1.0853 1.0845 1.0866 1.0878 1.0877 1.0922 1.0937 1.0920 1.0952 1.0958 1.0990 1.1009 1.1013 1.0950 1.0742
irintensity: 0.0581 0.1692 0.0857 0.0900 0.1457 0.2788 0.5832 0.3116 4.1038 1.5612 1.4080 2.4181 1.7555 0.3359 3.6119 4.5440 1.3740 2.2937 6.6679 2.3214 2.9649 0.7981 2.4751 1.3579 0.5945 0.2244 0.1261 12.4360 4.5186 3.8781 8.5131 5.9126 1.4150 0.6769 0.6363 10.2730 21.1320 29.0803 16.5528 73.3961 57.5343 67.8378 61.1885 44.9882 29.2539 16.8003 4.1016 0.2261 0.1603 0.0402 1.8872 20.4333 3.7241 2.6738 3.9323 11.5317 0.0941 0.2593 0.2119 0.2624 1.9029 0.4110 8.5556 0.6216 1.5344 27.8373 28.5798 19.5645 45.9026 9.4332 5.1999 11.4941 9.9446 1.2847 1.1512 16.3432 1.1697 75.3300 5.5377 8.0808 0.4228 0.2148 0.0260 1.8556 3.0805 15.0512 5.5263 0.2089 22.8614 1.2343 8.7774 6.7835 14.8148 3.7961 2.6786 23.6137 1.7206 4.2705 1.5856 1.1643 6.1907 5.5873 15.3739 8.7877 36.7609 3.9729 27.0484 13.6702 20.0346 8.9025 0.5332 8.9634 2.2526 1.8526 0.1647 0.8116 6.9969 3.7162 8.1893 73.8721 79.1380 63.4103 24.3593 18.2769 12.0619 57.4088 42.6113 22.9018 8.3513 4.7088 1.0087 0.9306 3.4867 3.9542 28.1212 33.3176 21.4174 31.3667 33.0848 32.3035 23.1692 21.7445 7.0288 0.6072
temp: 298.150 k
press: 1.00000 atm
elementType: 8 7 6 6 6 6 6 6 6 6 6 6 6 6 6 6 6 6 6 6 6 6 6 6 6 1 1 1 1 1 1 1 1 1 1 1 1 1 1 1 1 1 1 1 1 1 1 1 1 1
symmnumber: 1
zpe: 1094965.9 jmol-1
zpe.correction: 0.417050 hartree
zpe.thermalcorrener: 0.440253 hartree
zpe.thermalcorrenthalpy: 0.441198 hartree
zpe.thermalcorrgfe: 0.360946 hartree
zpe.sumelectzpe: -1019.590614 hartree
zpe.sumelectthermal: -1019.567411 hartree
zpe.sumelectthermalent: -1019.566467 hartree
zpe.sumelectthermalfe: -1019.646718 hartree
dipole: -0.3995 -0.5542 -0.6976
dipole: 0.9764
quadrupole: -145.5601 -136.7173 -144.6459
quadrupole: 4.7196 -1.3417 1.3185
quadrupole: -3.2523 5.5904 -2.3381 4.7196 -1.3417 1.3185
hfenergy: -1020.0076644 hartree
pointgroup: C01 [X(C23H25N1O1)]
dipole: -0.1581162 -0.2168237 -0.2748806 debye
polarizability: 284.0665222|1.8072261|273.1355392|-5.6715203|16.5765954|189.6931549 unknown
InChI: InChI=1S/C23H25NO/c1-25-23(21-13-7-3-8-14-21,22-15-9-4-10-16-22)17-18-24-19-20-11-5-2-6-12-20/h2-16,24H,17-19H2,1H3
charge 0 multiplicity 1
50 atoms
O  -1.648664 -0.170639 1.931786
N  2.183588 -0.051125 -0.003988
C  -1.666481 -0.162209 0.438788
C  -0.247965 -0.490463 -0.110281
C  -2.748179 -1.151908 -0.051871
C  -2.059966 1.280742 0.055176
C  0.856867 0.420468 0.455104
C  -2.493368 -2.208331 -0.959761
C  -2.110804 2.318195 1.016632
C  -4.066909 -0.99416 0.452368
C  -2.353927 1.583081 -1.298932
C  3.325001 0.712499 0.548717
C  -1.32087 -1.458178 2.549016
C  -3.531219 -3.084838 -1.358041
C  -2.446919 3.635986 0.628337
C  -5.101122 -1.868477 0.062785
C  -2.682873 2.899432 -1.687749
C  4.667438 0.1195 0.133979
C  -4.837301 -2.919973 -0.848607
C  -2.730072 3.934172 -0.723734
C  4.841037 -1.285688 0.046651
C  5.771728 0.963271 -0.143892
C  6.095161 -1.833438 -0.303375
C  7.029572 0.417371 -0.489317
C  7.195537 -0.984472 -0.570117
H  0.021512 -1.538706 0.119126
H  -0.269224 -0.39879 -1.214736
H  0.651324 1.481214 0.176067
H  0.838097 0.37655 1.56078
H  2.23543 -0.096062 -1.03251
H  -1.48806 -2.361723 -1.365128
H  -1.892577 2.078507 2.060311
H  -4.266663 -0.179303 1.157025
H  -2.346508 0.782577 -2.048858
H  3.230959 0.676624 1.654431
H  3.303647 1.796631 0.273819
H  -0.276156 -1.764865 2.341817
H  -2.009807 -2.259038 2.216387
H  -1.441707 -1.297276 3.632285
H  -3.316112 -3.895783 -2.063334
H  -2.486489 4.429509 1.383648
H  -6.112034 -1.7309 0.463062
H  -2.9106 3.115956 -2.737784
H  -5.640103 -3.599447 -1.156362
H  -2.989935 4.955985 -1.022889
H  3.978986 -1.930071 0.249629
H  5.64678 2.052418 -0.090742
H  6.216378 -2.921216 -0.366911
H  7.874261 1.083187 -0.700651
H  8.168615 -1.4098 -0.841054
