program: Gaussian 09
title: 000187761
version: EM64L-G09RevD.01
frameworkgroup: C1[X(C21H31NO)]
method: RPBEPBE
basis: SDD
operation: Freq
keyword: #p
keyword: freq=noraman
keyword: PBEPBE/SDD
title: #p freq=noraman PBEPBE/SDD
converged: YES YES NO NO
title: Mulliken charges:
elementType: O N C C C C C C C C C C C C C C C C C C C C C H H H H H H H H H H H H H H H H H H H H H H H H H H H H H H H
charge: -0.318106 -0.092806 0.256128 -0.164532 -0.009302 -0.583693 -0.547501 -0.471039 0.296226 -0.640455 -0.435523 -0.389032 -0.406076 0.288879 -0.607035 -0.685817 -0.429156 0.298148 -0.378037 0.290543 -0.692986 -0.696115 -0.694659 0.264223 0.205459 0.227324 0.244553 0.198222 0.203980 0.202784 0.226382 0.234220 0.236199 0.207844 0.224442 0.207880 0.190391 0.187433 0.200443 0.242993 0.227837 0.182803 0.234355 0.234672 0.240017 0.232468 0.213388 0.218989 0.229203 0.229262 0.197803 0.220308 0.212477 0.233588
chargesum: 0.00000
title: Mulliken charges with hydrogens summed into heavy atoms:
elementType: O N C C C C C C C C C C C C C C C C C C C C C
charge: -0.318106 -0.092806 0.256128 0.099691 0.196157 -0.111816 -0.145299 -0.041874 0.296226 -0.170035 -0.003236 0.009239 -0.018200 0.288879 -0.364042 -0.040821 -0.194484 0.298148 -0.138020 0.290543 -0.028140 -0.039847 -0.028286
polarizability: 2.94232492e+02 -2.77701511e+00 2.12619918e+02 4.35296541e-02 -1.65436677e+01 1.95233341e+02
1716.lowfreq: -11.6337 -7.4057 -0.0003 0.0005 0.0007 7.7748 13.5778 34.9567 53.0274
frequency: 13.4781 34.9439 52.9968 86.7048 103.5191 130.4238 143.7743 169.4565 171.0910 182.5290 219.8673 234.0549 242.3121 255.2798 261.2059 271.1942 275.4560 282.5847 299.9117 331.7146 342.6595 354.3989 364.7251 381.3115 396.9933 412.0626 424.5109 438.9117 445.5493 452.6555 469.5031 502.6400 509.9770 514.1477 543.3395 556.7264 576.2365 620.3287 632.4654 682.8264 685.8178 719.4290 730.5451 742.8279 778.5067 800.8672 813.0528 830.6964 839.4551 846.9690 867.2745 870.8942 903.0286 903.1376 908.2096 919.6938 920.7870 935.2133 943.7729 944.0743 955.6301 958.1457 987.3663 1014.7312 1015.8715 1026.6298 1038.1193 1044.9059 1078.3598 1094.9302 1098.0590 1108.9465 1117.8010 1123.7658 1125.7630 1131.9922 1142.0233 1148.8623 1159.5431 1165.1095 1184.4724 1196.5283 1211.3277 1212.5912 1227.9188 1242.8692 1246.3401 1256.3229 1264.7471 1266.7363 1272.5730 1290.7315 1299.1971 1316.0533 1318.8578 1325.7453 1336.0870 1337.3102 1340.4092 1369.1912 1374.7903 1389.5983 1392.6257 1396.5969 1419.1985 1424.3086 1444.5035 1450.1866 1459.9892 1462.2533 1463.7281 1464.4880 1465.7076 1467.9823 1468.7484 1468.9179 1471.7324 1473.3520 1475.2515 1476.5572 1479.9308 1492.6436 1552.2039 1601.8041 1643.6562 2846.9039 2865.9537 2962.0904 2963.2038 2974.4452 2979.8645 2980.1546 2982.6133 2983.6769 2991.1550 2992.5941 2998.2316 3015.3461 3020.7865 3025.9847 3026.4356 3033.0059 3035.3197 3046.6506 3050.8031 3059.6555 3074.5162 3080.5002 3081.9403 3085.8996 3090.5345 3095.2424 3099.2014 3115.8888 3144.6522 3161.3710
redmass: 2.9159 3.9572 3.5653 3.9384 3.1685 3.0970 3.1547 3.1085 1.0296 2.7900 2.5082 1.0774 1.7463 1.3085 1.4006 2.0795 2.8926 2.6247 2.4219 2.1259 3.1717 2.6852 2.5506 2.5692 2.5794 2.9306 2.8380 2.9421 2.9958 3.4532 3.5705 3.1598 2.7799 3.1481 3.2736 3.7460 2.5917 3.5798 3.8121 3.9330 4.7327 2.4700 3.7690 3.4061 2.3791 2.3130 2.6989 1.5295 2.5240 2.0918 3.0109 2.5753 1.6247 1.6150 2.2550 1.7449 2.1603 2.2463 1.4308 1.2178 2.5729 1.8622 2.0201 2.1047 1.4353 1.4156 2.6596 2.7751 1.5207 1.7456 1.7662 1.7372 1.5767 1.6116 1.7634 1.3593 1.8742 1.7476 2.7539 2.0671 1.4234 2.4780 2.1010 1.5908 1.6535 1.8713 2.8952 1.3333 1.6010 2.0604 1.7008 1.6282 1.5994 1.2937 1.4707 1.3140 2.3624 1.7811 1.5025 1.2529 1.2494 2.2014 1.5901 1.2181 1.2330 1.1673 1.0491 2.6631 1.0911 1.0609 1.0740 1.0581 1.0895 1.0746 1.0477 1.0601 1.0888 1.0637 1.0919 1.0877 1.0995 1.0544 5.6850 6.5824 1.0755 1.0561 1.0774 1.0628 1.0606 1.0627 1.0350 1.0603 1.0614 1.0353 1.0591 1.0355 1.0608 1.0975 1.0876 1.0781 1.0896 1.1034 1.1024 1.1039 1.1016 1.1033 1.0993 1.0989 1.1012 1.1013 1.1002 1.0994 1.0999 1.0889 1.0901 1.0949
irintensity: 0.2773 0.3775 0.8244 0.2203 0.4449 1.1900 0.9103 0.4990 0.0014 0.3348 0.1299 0.0541 1.1933 0.3832 0.1139 1.3601 0.4571 0.5899 1.1530 0.3920 0.7228 0.1952 2.5737 1.4798 3.5285 1.0640 0.2488 0.9292 6.2527 2.1722 4.7761 3.5519 5.4184 4.3983 1.0639 2.5942 6.3550 4.2113 8.6104 0.7983 2.0730 1.7088 7.4854 5.2138 1.8424 2.0923 4.5203 24.3772 15.1589 5.5939 14.7047 21.9653 10.7925 0.3650 42.1032 4.2334 37.1717 14.0909 0.5344 0.3588 12.7285 2.8956 3.7426 0.8917 0.2780 1.8578 4.5216 1.8768 0.6986 2.8791 1.7700 3.2766 9.6384 16.9892 17.8735 6.7327 2.1841 70.7863 173.3071 32.6093 1.7732 4.6753 6.5673 0.3692 1.0494 9.5808 22.1520 1.4765 14.1240 24.6365 1.7126 13.6198 1.0319 2.1523 2.5441 0.9701 4.0148 1.0413 0.2617 34.2003 32.0797 28.2138 4.2280 22.7542 11.6730 3.5731 0.4502 43.1433 7.6161 0.6700 3.9868 6.4788 24.3522 1.0763 18.8069 4.1642 14.0619 9.4903 7.0901 4.4703 5.3185 24.0604 34.6721 39.7884 3.3256 99.7861 56.9076 41.3470 26.6086 26.7648 16.7813 24.4996 18.4244 13.6718 51.9219 26.0789 72.1702 37.5059 19.3937 64.2798 52.5019 3.7392 45.9575 30.6111 60.6902 84.1716 3.2089 53.2665 28.3434 7.6648 28.8693 59.7445 34.7126 16.3299 7.4453 14.0697
temp: 298.150 k
press: 1.00000 atm
elementType: 8 7 6 6 6 6 6 6 6 6 6 6 6 6 6 6 6 6 6 6 6 6 6 1 1 1 1 1 1 1 1 1 1 1 1 1 1 1 1 1 1 1 1 1 1 1 1 1 1 1 1 1 1 1
symmnumber: 1
zpe: 1243438.4 jmol-1
zpe.correction: 0.473601 hartree
zpe.thermalcorrener: 0.495616 hartree
zpe.thermalcorrenthalpy: 0.496560 hartree
zpe.thermalcorrgfe: 0.423998 hartree
zpe.sumelectzpe: -946.942590 hartree
zpe.sumelectthermal: -946.920575 hartree
zpe.sumelectthermalent: -946.919631 hartree
zpe.sumelectthermalfe: -946.992193 hartree
dipole: -0.9047 0.9546 0.2855
dipole: 1.3459
quadrupole: -138.7342 -137.4786 -139.0533
quadrupole: -5.5610 -7.4789 -5.0216
quadrupole: -0.3122 0.9434 -0.6313 -5.5610 -7.4789 -5.0216
hfenergy: -947.4161907 hartree
pointgroup: C01 [X(C21H31N1O1)]
dipole: -0.3466678 -0.3826879 -0.1172878 debye
polarizability: 294.0578963|4.709527|213.006077|1.0358831|-16.3894065|195.0217773 unknown
InChI: InChI=1S/C21H31NO/c1-20(2,3)23-16-9-8-15-13-19-17-7-5-6-10-21(17,18(15)14-16)11-12-22(19)4/h8-9,14,17,19H,5-7,10-13H2,1-4H3
charge 0 multiplicity 1
54 atoms
O  -3.391781 0.841967 0.805678
N  4.073261 0.843864 0.354411
C  1.358944 -0.824247 0.655241
C  2.416613 -0.757287 -0.460898
C  2.73427 0.76487 -0.304374
C  2.20881 -0.330108 1.939216
C  0.813064 -2.264984 0.837987
C  1.971707 -1.369311 -1.806863
C  0.251357 0.19169 0.1428
C  1.960333 1.523951 -1.388047
C  3.75701 0.024135 1.642135
C  0.376527 -2.897427 -0.508077
C  1.512194 -2.831421 -1.561799
C  0.506225 1.188353 -0.894277
C  -1.063162 0.094764 0.652972
C  4.452708 2.242922 0.669667
C  -0.567636 1.981083 -1.35516
C  -2.123487 0.90421 0.175812
C  -1.877829 1.849618 -0.842873
C  -4.445131 -0.106468 0.25939
C  -3.94605 -1.563371 0.359974
C  -5.63149 0.150016 1.202918
C  -4.788852 0.268239 -1.197288
H  3.311471 -1.333272 -0.167251
H  2.109845 1.145596 0.532296
H  2.238357 -1.151919 2.68267
H  1.700905 0.517484 2.436278
H  -0.014388 -2.303481 1.573244
H  1.633986 -2.87831 1.26481
H  2.813314 -1.348433 -2.52657
H  1.134468 -0.8136 -2.266363
H  2.142878 1.191319 -2.426145
H  2.099743 2.621254 -1.349561
H  4.150851 0.584739 2.512425
H  4.322305 -0.922695 1.584214
H  -0.512876 -2.363447 -0.898308
H  0.072856 -3.949744 -0.343183
H  2.37318 -3.435804 -1.20639
H  1.172688 -3.285815 -2.512771
H  -1.290404 -0.617904 1.452523
H  5.373983 2.251842 1.278033
H  3.660997 2.812866 1.22144
H  4.665039 2.778047 -0.273102
H  -0.367036 2.744114 -2.117638
H  -2.690411 2.494344 -1.192081
H  -3.05536 -1.727414 -0.272675
H  -4.736903 -2.258348 0.02272
H  -3.686986 -1.811693 1.404392
H  -5.940362 1.208153 1.148143
H  -5.344583 -0.071022 2.245438
H  -6.491279 -0.486806 0.927208
H  -5.123664 1.318786 -1.256992
H  -5.604129 -0.378428 -1.570709
H  -3.916894 0.136734 -1.862032
