program: Gaussian 09
title: 000185198
version: EM64L-G09RevD.01
frameworkgroup: C1[X(C9H5Cl2F3OS)]
method: RPBEPBE
basis: SDD
operation: Freq
keyword: #p
keyword: freq=noraman
keyword: PBEPBE/SDD
title: #p freq=noraman PBEPBE/SDD
converged: NO YES NO NO
title: Mulliken charges:
elementType: Cl Cl S F F F O C C C C C C C C C H H H H H
charge: 0.002519 0.010099 0.282288 -0.161385 -0.122855 -0.162220 -0.120014 -0.227135 -0.741278 -0.196223 -0.222172 0.181730 -0.046003 -0.178675 -0.098938 0.354621 0.311844 0.312164 0.286884 0.267847 0.266901
chargesum: 0.00000
title: Mulliken charges with hydrogens summed into heavy atoms:
elementType: Cl Cl S F F F O C C C C C C C C C
charge: 0.002519 0.010099 0.282288 -0.161385 -0.122855 -0.162220 -0.120014 -0.227135 -0.117270 0.090661 0.045675 0.181730 -0.046003 0.088226 -0.098938 0.354621
polarizability: 2.01404124e+02 -1.54077455e+01 1.18962289e+02 -2.44714685e+01 -9.77399469e+00 9.77766536e+01
1716.lowfreq: -0.0024 -0.0014 -0.0011 3.0099 4.5687 8.2357 12.1205 13.8695 31.0437
frequency: 10.6601 13.3831 31.0256 47.6112 61.9514 95.3559 135.2983 164.9421 183.9940 193.1972 205.7726 213.9649 286.6510 315.7391 334.3450 375.0854 376.1830 428.0432 429.4388 442.4449 495.6371 530.6522 556.6749 560.6571 617.2536 657.8814 694.4164 708.7421 764.0999 777.0798 826.9430 864.7634 891.4294 959.0109 993.5301 996.1176 998.3098 1068.0934 1081.1246 1117.7616 1132.3898 1140.1770 1170.8640 1241.3399 1276.0575 1345.0949 1364.5133 1406.3284 1436.6509 1559.7866 1567.0680 1664.5353 3006.9503 3065.9908 3158.8853 3169.7312 3178.7165
redmass: 12.4298 17.8265 16.1042 10.6906 3.1157 9.3178 9.1881 8.5824 17.3423 17.6013 11.6111 8.6103 11.1985 14.2188 10.4290 13.5998 8.7768 7.7292 8.5965 3.1625 14.5186 9.8515 2.9625 5.5342 13.3061 7.4451 4.0921 9.1396 8.5639 6.5305 1.3622 1.9782 1.4169 1.3455 8.5570 5.7684 5.2341 10.5074 2.2376 3.4067 1.1743 1.3763 4.1856 1.2949 1.7670 3.6830 6.6165 1.0929 2.4238 8.3116 7.1241 10.9859 1.0576 1.1022 1.0890 1.0930 1.0975
irintensity: 0.2015 0.0422 0.4113 2.6395 6.7909 0.2116 0.4428 0.9491 0.5357 0.7322 7.0237 1.0801 0.9050 2.8457 4.5167 3.4674 4.8943 4.9078 0.4292 10.1592 6.5597 10.0209 0.2427 5.5044 39.3545 12.0956 2.8334 20.0044 22.3510 26.3811 28.4460 29.1903 14.9066 0.2132 191.8316 151.1050 71.6855 159.9474 4.0007 52.2568 3.8248 1.9265 111.0103 2.3439 7.8668 14.0563 10.1439 53.3345 106.2804 17.8914 2.3746 124.2541 18.2141 0.0464 0.5269 0.1626 1.1928
temp: 298.150 k
press: 1.00000 atm
elementType: 17 17 16 9 9 9 8 6 6 6 6 6 6 6 6 6 1 1 1 1 1
symmnumber: 1
zpe: 313363.8 jmol-1
zpe.correction: 0.119354 hartree
zpe.thermalcorrener: 0.135576 hartree
zpe.thermalcorrenthalpy: 0.136520 hartree
zpe.thermalcorrgfe: 0.070227 hartree
zpe.sumelectzpe: -2037.691900 hartree
zpe.sumelectthermal: -2037.675679 hartree
zpe.sumelectthermalent: -2037.674735 hartree
zpe.sumelectthermalfe: -2037.741027 hartree
dipole: -1.5089 -1.0659 1.4567
dipole: 2.3527
quadrupole: -134.7466 -108.2710 -116.9080
quadrupole: 4.8762 2.3416 -6.3515
quadrupole: -14.7714 11.7042 3.0672 4.8762 2.3416 -6.3515
hfenergy: -2037.8112544 hartree
pointgroup: C01 [X(C9H5Cl2F3O1S1)]
dipole: 0.5905361 0.4164112 0.5784768 debye
dipolederiv: -0.2507571 0.2622772 0.0293251 0.3566524 -0.5452067 -0.0965333 0.0491202 -0.1046359 -0.053388 -0.6562488 0.0426187 -0.2795714 0.0575092 -0.0518157 0.012452 -0.3250924 0.0098189 -0.1711614 -0.0032409 -0.0008982 0.0364046 -0.0938564 -0.0561747 -0.1107535 0.1948496 -0.0996344 0.1339522 -0.4175221 0.0584744 0.0491596 0.0338279 -0.7685586 0.0769245 0.0919834 0.1389093 -0.336653 -1.0231293 -0.0071728 -0.1030567 -0.0673619 -0.2662221 0.0148595 -0.00137 0.0215814 -0.3042791 -0.4013597 -0.0534173 0.0305137 -0.0843506 -0.4161857 -0.158255 0.0792307 -0.2198536 -0.7131318 -0.6429772 0.0159563 -0.0911409 0.0865736 -0.2731977 0.1386906 -0.2616308 0.1271107 -0.5164917 0.4810342 -0.0606048 0.1774817 -0.041968 0.0254131 0.0833294 0.1303786 0.0866915 -0.097319 -0.492309 0.0779634 -0.2586883 0.2191095 0.068681 0.0630995 -0.5625408 0.0551307 -0.0877516 -0.2596189 0.1788712 0.0288711 0.0176097 -0.1953767 -0.0459741 -0.0935236 0.0373629 -0.0575003 -0.2001043 -0.07115 -0.0215571 0.0843322 -0.0012905 0.0640559 0.0132776 0.0002225 -0.0949063 1.0839138 0.0280275 0.1054237 -0.123549 0.1564272 -0.2539905 0.4686749 -0.2335155 0.5854621 0.1044659 -0.5022454 -0.1769207 -0.4764552 0.8122475 0.1996318 -0.145224 0.1261281 -0.0311973 -0.2390904 0.0234827 -0.0622215 0.052798 -0.0100079 0.0606754 -0.0503575 0.0452754 -0.0784236 0.906047 0.0372216 0.5118135 -0.0609958 -0.1093338 -0.0699171 0.5001219 -0.0099858 0.1978442 1.6083339 -0.0393827 0.0728798 0.0634452 1.4279949 0.141964 -0.1094351 0.1356556 1.225942 0.0793555 -0.0217749 0.0392337 -0.0304341 0.0831579 -0.0330496 0.0831779 -0.0239909 -0.0125512 0.0809416 -0.0080951 0.0327954 -0.0324337 -0.0098814 0.0485222 0.0700646 0.0432105 0.0797704 0.1044623 -0.0251489 -0.0497296 -0.0226933 0.0642798 -0.042825 -0.0517157 -0.0454386 0.1033402 0.0780012 0.0833416 -0.0137706 0.0767298 0.0224883 -0.0280758 -0.0165468 -0.0223085 0.1254799 0.0598024 -0.0183444 -0.0572451 -0.0144894 0.0425619 -0.0648308 -0.0634428 -0.0677342 0.1029634 unknown
polarizability: 198.6377919|-17.6511751|120.6450316|28.3939142|7.6936871|98.8602427 unknown
InChI: InChI=1S/C9H5Cl2F3OS/c10-6-2-1-5(3-7(6)11)16-4-8(15)9(12,13)14/h1-3H,4H2
charge 0 multiplicity 1
21 atoms
Cl 4.077015 -2.325967 -0.506822
Cl 5.368623 0.06198 1.352585
S  -0.383916 0.878505 -1.505908
F  -3.531535 -1.802811 0.808678
F  -5.209887 -0.391323 0.217043
F  -3.712808 0.236081 1.80576
O  -3.391748 0.635282 -1.565898
C  1.240261 0.623964 -0.658194
C  -1.455208 0.125545 -0.137509
C  1.944394 -0.585592 -0.851997
C  1.797004 1.655619 0.132304
C  -2.918168 0.169914 -0.513964
C  3.202801 -0.765645 -0.239756
C  3.057621 1.471043 0.740458
C  3.758703 0.260199 0.556909
C  -3.868159 -0.44551 0.571147
H  -1.295663 0.680946 0.805329
H  -1.147125 -0.92143 0.040449
H  1.528644 -1.377239 -1.481617
H  1.256643 2.597588 0.264112
H  3.501308 2.260551 1.353487
