program: Gaussian 09
title: 000185193
version: EM64L-G09RevD.01
frameworkgroup: C1[X(C11H14N2O2S2)]
method: RPBEPBE
basis: SDD
operation: Freq
keyword: #p
keyword: freq=noraman
keyword: PBEPBE/SDD
title: #p freq=noraman PBEPBE/SDD
converged: YES YES NO NO
title: Mulliken charges:
elementType: S S O O N N C C C C C C C C C C C H H H H H H H H H H H H H H
charge: 0.204312 0.080830 -0.257127 -0.265902 -0.412574 -0.448530 -0.363743 -0.335415 -0.551910 -0.357118 0.354213 0.251219 -0.463882 0.625828 -0.692645 0.024855 -0.670394 0.203155 0.237422 0.187740 0.188356 0.222658 0.239551 0.197342 0.200424 0.344652 0.210778 0.209681 0.219019 0.331894 0.285311
chargesum: 0.00000
title: Mulliken charges with hydrogens summed into heavy atoms:
elementType: S S O O N N C C C C C C C C C C C
charge: 0.204312 0.080830 -0.257127 -0.265902 -0.067922 -0.116636 0.076834 0.040681 -0.089701 0.040648 0.354213 0.251219 -0.463882 0.625828 -0.053168 0.024855 -0.385082
polarizability: 2.89473433e+02 -3.68559093e+01 2.12144354e+02 -1.90806236e+01 -7.24443787e-01 9.33736645e+01
1716.lowfreq: -18.4163 -7.7333 -4.2238 -0.0019 -0.0016 0.0012 10.3776 21.9155 29.5434
frequency: -9.9545 19.9910 29.5136 80.9998 85.4288 98.6651 116.9063 124.3895 133.0574 157.3611 191.1504 222.9768 236.0773 261.1561 272.6512 294.9357 320.2520 339.3515 369.2722 392.7091 413.0148 446.4772 466.0337 503.6199 553.8169 606.8846 638.6637 678.3849 686.5356 717.3232 719.9346 725.2086 728.5665 755.9115 773.7053 792.6517 837.9185 885.6033 925.5551 952.5915 987.5560 1004.9939 1049.1122 1053.7392 1077.1457 1095.7221 1111.7817 1156.5374 1165.4937 1195.7514 1223.4721 1241.5303 1259.7908 1282.2249 1285.7403 1291.3498 1300.1044 1321.6869 1343.6730 1353.0520 1357.3621 1388.5033 1446.7847 1465.4878 1470.5828 1476.1087 1480.4648 1483.5658 1487.9809 1547.1335 1616.2206 1633.5865 1635.9326 2953.0615 2970.1601 2973.1127 2979.1781 2987.2443 2996.1754 3023.9607 3035.0950 3062.7815 3070.1890 3073.5611 3185.7437 3489.4166 3611.5854
redmass: 2.5499 2.6001 4.6263 4.8829 3.6220 3.7895 2.4760 3.5931 8.3823 7.5920 5.1674 1.1303 4.9212 5.2253 6.1799 6.5108 8.1152 20.3520 11.0178 3.7783 3.6555 3.4508 6.5483 1.3634 5.3760 4.5993 5.0620 6.5416 8.2760 9.7155 1.2085 1.6463 1.8361 1.1977 1.4937 4.5779 1.2729 2.3214 3.4477 1.2920 5.4790 4.1175 4.8366 3.2794 2.3357 1.5051 2.3391 3.2435 1.5336 1.6320 1.5966 1.3598 1.5223 1.6125 1.1839 1.1841 2.1606 1.8371 1.6418 1.6282 2.7837 1.2143 1.1344 1.0682 1.0743 1.0429 1.0760 3.7605 1.0906 2.8971 10.8295 10.4477 7.6200 1.0589 1.0587 1.0368 1.0602 1.0651 1.0938 1.1011 1.1013 1.1035 1.1011 1.0992 1.0934 1.0771 1.0807
irintensity: 0.0718 0.5228 0.5926 1.6690 2.9567 1.6619 6.0771 5.9091 5.1809 2.4141 9.0729 0.0289 3.0681 2.6955 1.0855 11.3912 4.0128 39.9911 0.4503 5.5881 4.2436 15.0692 4.1538 108.1553 31.2907 1.0925 1.8033 1.3344 26.4475 4.7838 57.3740 12.1498 17.5927 2.7473 80.5081 39.9425 3.2800 3.6464 5.5648 2.0668 4.0677 0.4365 2.7014 8.0205 0.4304 3.6682 23.9723 6.8527 20.4732 6.3333 17.8915 12.4195 35.9549 55.0915 5.5905 2.3913 24.7675 31.5231 10.6844 1.7250 14.5228 10.6089 11.2898 1.0933 1.4918 13.0686 2.4202 150.7706 23.9786 239.3035 136.1062 36.3507 387.5101 15.3456 45.6501 38.4782 1.9731 47.7591 10.1631 21.4694 0.4896 15.0573 113.2428 50.8701 3.3554 55.5387 75.7924
temp: 298.150 k
press: 1.00000 atm
elementType: 16 16 8 8 7 7 6 6 6 6 6 6 6 6 6 6 6 1 1 1 1 1 1 1 1 1 1 1 1 1 1
symmnumber: 1
zpe: 623593.4 jmol-1
zpe.correction: 0.237514 hartree
zpe.thermalcorrener: 0.254583 hartree
zpe.thermalcorrenthalpy: 0.255527 hartree
zpe.thermalcorrgfe: 0.190786 hartree
zpe.sumelectzpe: -1482.393434 hartree
zpe.sumelectthermal: -1482.376366 hartree
zpe.sumelectthermalent: -1482.375422 hartree
zpe.sumelectthermalfe: -1482.440162 hartree
dipole: -0.5112 0.8817 -0.2227
dipole: 1.0432
quadrupole: -89.1284 -129.3759 -117.3359
quadrupole: 1.8643 -4.1184 0.8069
quadrupole: 22.8184 -17.4292 -5.3892 1.8643 -4.1184 0.8069
hfenergy: -1482.6309483 hartree
pointgroup: C01 [X(C11H14N2O2S2)]
dipole: -0.1570212 0.1418098 0.351706 debye
polarizability: 283.2260532|-2.5252134|93.6728172|-43.7560635|16.8335265|218.0925809 unknown
InChI: InChI=1S/C11H14N2O2S2/c1-2-3-4-5-8(14)13-9-10-7(6-16-17-10)12-11(9)15/h6,12-13H,2-5H2,1H3
charge 0 multiplicity 1
31 atoms
S  1.625129 -0.664408 -2.236733
S  3.93128 -0.561911 -2.877918
O  -0.751174 -0.721135 -1.253919
O  1.990337 0.237766 2.975426
N  -0.021693 -0.28524 0.914725
N  3.576268 0.076526 1.171488
C  -3.386579 0.351463 -0.273741
C  -4.861193 0.189826 0.154687
C  -2.440083 -0.595073 0.509191
C  -5.814375 1.1363 -0.610733
C  1.35118 -0.207771 0.636886
C  -1.010213 -0.53843 -0.009888
C  2.075086 -0.339934 -0.53432
C  3.494346 -0.161343 -0.214961
C  -7.291288 0.963477 -0.195518
C  2.283882 0.06006 1.753853
C  4.454388 -0.23713 -1.19227
H  -3.066709 1.40187 -0.12269
H  -3.279004 0.137335 -1.353465
H  -4.959278 0.376937 1.244772
H  -5.179317 -0.860755 -0.011891
H  -2.473947 -0.364878 1.59181
H  -2.799466 -1.635711 0.384576
H  -5.500933 2.186307 -0.440167
H  -5.710455 0.953612 -1.699444
H  -0.264074 -0.139734 1.90131
H  -7.638538 -0.069561 -0.385932
H  -7.427668 1.16979 0.882917
H  -7.951282 1.650042 -0.756564
H  4.425734 0.243405 1.707051
H  5.52914 -0.115002 -1.038636
