program: Gaussian 09
title: 000185191
version: EM64L-G09RevD.01
frameworkgroup: C1[X(C12H16N2O2S2)]
method: RPBEPBE
basis: SDD
operation: Freq
keyword: #p
keyword: freq=noraman
keyword: PBEPBE/SDD
title: #p freq=noraman PBEPBE/SDD
converged: YES YES NO NO
title: Mulliken charges:
elementType: S S O O N N C C C C C C C C C C C C H H H H H H H H H H H H H H H H
charge: 0.104442 0.127063 -0.222186 -0.221894 -0.232280 -0.473457 -0.359486 -0.337858 -0.550623 0.338408 -0.356107 0.643458 -0.403620 0.101137 0.208868 -0.694827 -0.636830 -0.670197 0.197749 0.239259 0.181588 0.186224 0.210618 0.244198 0.194802 0.200658 0.308844 0.210553 0.207743 0.216744 0.277247 0.230474 0.236942 0.292347
chargesum: 0.00000
title: Mulliken charges with hydrogens summed into heavy atoms:
elementType: S S O O N N C C C C C C C C C C C C
charge: 0.104442 0.127063 -0.222186 -0.221894 -0.232280 -0.164614 0.077521 0.029954 -0.095807 0.338408 0.039354 0.643458 -0.403620 0.101137 0.208868 -0.059787 0.107832 -0.377850
polarizability: 2.62908561e+02 -3.45822817e+01 2.07859960e+02 1.86031993e+01 -1.54637760e+00 1.16143654e+02
1716.lowfreq: -20.0567 -6.6628 -3.1639 0.0018 0.0022 0.0028 4.5063 17.1420 29.2545
frequency: -18.9927 16.9120 29.0016 36.3145 63.2100 86.7456 103.7151 107.5262 126.0593 127.9333 137.0407 166.8410 178.6952 215.6443 230.0473 238.5864 252.8756 271.7593 313.4337 325.4836 372.1591 391.3362 393.2751 422.0011 431.0435 437.1350 493.0831 554.2639 580.9641 626.1155 648.3069 683.1104 707.7534 724.8599 731.7609 749.9347 767.1352 779.7493 840.4726 861.5122 891.0066 930.4378 954.8925 971.2474 1006.1879 1023.5620 1065.0810 1076.8356 1092.0528 1113.1724 1124.2926 1126.0635 1166.0456 1200.2180 1238.6623 1241.5286 1246.9655 1261.2938 1275.5599 1285.5546 1292.7262 1314.7215 1350.1628 1357.7717 1378.2389 1388.1457 1428.7655 1438.0701 1439.1519 1464.7742 1469.9469 1477.4768 1479.8948 1480.0987 1483.5047 1487.7478 1589.6088 1619.7117 1637.9661 1646.7976 2950.1077 2966.1181 2969.0397 2971.9217 2977.2041 2984.4785 2993.8993 3016.6885 3024.3616 3059.4396 3060.2356 3068.8055 3071.7326 3102.3884 3195.6021 3515.6862
redmass: 3.4385 5.4671 3.4170 2.8675 4.4035 4.5108 4.5198 2.2606 2.3296 5.8156 3.9178 1.0818 5.0091 4.1163 1.1317 3.6221 4.2947 3.8743 6.5878 9.1831 5.4408 5.9253 10.6486 7.6768 4.2750 6.3145 1.3025 3.4049 5.5707 3.3605 5.7209 6.9156 7.3828 1.0911 1.8910 1.5782 2.6951 5.0526 1.3470 6.4966 2.0633 3.9885 1.3964 3.3627 3.7413 4.3562 2.9773 2.1671 1.5616 2.2715 1.3000 1.6723 2.2095 1.5472 2.8544 1.3716 2.4504 1.3461 4.0477 1.1057 1.1690 1.3397 1.5315 1.6668 4.1068 1.2174 1.7146 1.3184 1.1829 1.0682 1.0725 1.0426 1.0697 1.0435 1.0583 1.0884 11.4275 10.1500 7.9424 9.6957 1.0589 1.0590 1.0580 1.0375 1.0342 1.0705 1.0907 1.0973 1.1030 1.1024 1.1027 1.1008 1.0993 1.0988 1.0934 1.0768
irintensity: 1.9726 1.1127 1.9156 0.7173 2.8490 3.4374 3.0237 1.4001 0.9165 0.7964 1.9322 0.1120 0.8329 8.2392 0.1331 1.6357 2.0348 0.9399 11.0204 2.8797 0.1307 1.9908 1.8404 2.3312 12.4704 1.8628 51.8944 23.5762 7.9872 3.3180 14.0802 4.5177 7.0080 11.2881 63.0841 0.7740 1.4377 48.2164 3.4662 6.2822 4.2911 1.0265 2.7296 32.4670 9.7733 31.9420 2.1814 4.5887 13.9960 6.3933 0.0720 1.0093 75.0619 2.7391 52.7499 27.6788 55.8669 8.7719 90.3612 1.9404 2.7873 19.9802 3.2137 6.3782 49.8346 10.7944 286.5874 59.6900 49.3565 0.0929 0.6125 12.3477 5.2702 17.5892 13.9230 21.1265 55.8994 140.3762 102.4807 273.1783 16.5136 16.9451 50.6189 35.2014 58.4746 33.4837 14.4526 14.4585 13.8738 21.0696 29.3508 108.4986 54.1462 0.5922 9.0298 18.5277
temp: 298.150 k
press: 1.00000 atm
elementType: 16 16 8 8 7 7 6 6 6 6 6 6 6 6 6 6 6 6 1 1 1 1 1 1 1 1 1 1 1 1 1 1 1 1
symmnumber: 1
zpe: 691845.0 jmol-1
zpe.correction: 0.263510 hartree
zpe.thermalcorrener: 0.282701 hartree
zpe.thermalcorrenthalpy: 0.283645 hartree
zpe.thermalcorrgfe: 0.213363 hartree
zpe.sumelectzpe: -1521.593281 hartree
zpe.sumelectthermal: -1521.574090 hartree
zpe.sumelectthermalent: -1521.573146 hartree
zpe.sumelectthermalfe: -1521.643428 hartree
dipole: 3.1000 -1.8464 -2.4901
dipole: 4.3840
quadrupole: -94.8521 -127.5234 -123.7282
quadrupole: 8.0928 8.2245 1.9540
quadrupole: 20.5158 -12.1555 -8.3603 8.0928 8.2245 1.9540
hfenergy: -1521.8567908 hartree
pointgroup: C01 [X(C12H16N2O2S2)]
dipole: 1.229674 1.1549214 0.3592133 debye
polarizability: 257.2421907|17.6354205|180.9922782|-41.2513838|-43.8329359|148.6777053 unknown
InChI: InChI=1S/C12H16N2O2S2/c1-3-4-5-6-9(15)13-10-11-8(7-17-18-11)14(2)12(10)16/h7,13H,3-6H2,1-2H3
charge 0 multiplicity 1
34 atoms
S  2.184338 2.314996 -1.305571
S  4.402873 1.991998 -1.9298
O  1.261869 -2.027638 1.590788
O  -1.116595 -1.019404 -0.834873
N  3.11085 -1.192826 0.331432
N  -0.152477 0.521087 0.625509
C  -3.753507 0.186886 -0.355129
C  -5.142613 0.377615 0.291354
C  -2.606859 0.232869 0.677883
C  1.178663 0.129927 0.3461
C  -6.296674 0.336178 -0.736176
C  3.370522 -0.038269 -0.411454
C  2.146246 0.776343 -0.393595
C  1.771349 -1.149341 0.847076
C  -1.25463 -0.156962 0.073935
C  -7.686504 0.518474 -0.089025
C  4.037957 -2.293608 0.58336
C  4.482881 0.396198 -1.085762
H  -3.589032 0.967094 -1.125187
H  -3.705758 -0.784356 -0.881858
H  -5.175551 1.345133 0.836133
H  -5.30507 -0.413732 1.053376
H  -2.551777 1.23177 1.155983
H  -2.820066 -0.494209 1.488721
H  -6.135248 1.125821 -1.498298
H  -6.263321 -0.629847 -1.279522
H  -0.325449 1.206504 1.364785
H  -7.88584 -0.277941 0.65274
H  -7.756081 1.490169 0.435943
H  -8.492442 0.484884 -0.845049
H  3.508204 -3.027315 1.213154
H  4.939534 -1.945126 1.120594
H  4.340401 -2.78524 -0.359517
H  5.433906 -0.13243 -1.177149
