program: Gaussian 09
title: 000187748
version: EM64L-G09RevD.01
frameworkgroup: C1[X(C22H29NO)]
method: RPBEPBE
basis: SDD
operation: Freq
keyword: #p
keyword: freq=noraman
keyword: PBEPBE/SDD
title: #p freq=noraman PBEPBE/SDD
converged: YES YES NO NO
title: Mulliken charges:
elementType: O N C C C C C C C C C C C C C C C C C C C C C C H H H H H H H H H H H H H H H H H H H H H H H H H H H H H
charge: -0.227681 -0.088269 0.216094 -0.158141 -0.052781 -0.592364 -0.553113 -0.464899 0.281737 -0.365483 -0.632391 -0.430901 -0.139364 -0.388887 -0.405640 0.291705 -0.513915 -0.479809 -0.590109 -0.417332 0.317663 -0.401092 0.085459 -0.796084 0.232182 0.253790 0.231168 0.239752 0.196186 0.207735 0.196539 0.227367 0.223914 0.176906 0.237044 0.242422 0.156362 0.221368 0.248843 0.216494 0.192941 0.186660 0.205039 0.242361 0.217104 0.215057 0.235080 0.243192 0.241665 0.279931 0.238950 0.237844 0.261700
chargesum: 0.00000
title: Mulliken charges with hydrogens summed into heavy atoms:
elementType: O N C C C C C C C C C C C C C C C C C C C C C C
charge: -0.227681 -0.088269 0.216094 0.074041 0.201008 -0.121443 -0.149192 -0.040993 0.281737 0.035338 -0.152925 -0.053171 0.109480 0.020548 -0.013941 0.291705 -0.054450 -0.029673 -0.346918 -0.175666 0.317663 -0.121161 0.085459 -0.057590
polarizability: 3.25788611e+02 7.86783942e+00 2.05901632e+02 9.37770650e+00 -2.22631358e+01 1.99893630e+02
1716.lowfreq: -13.2905 -2.8771 0.0002 0.0007 0.0008 11.9964 31.8007 45.5277 51.2966
frequency: 31.7817 45.4789 51.2071 64.8657 73.8250 102.0162 119.9003 143.7404 156.5192 163.3558 168.3426 192.7038 199.7784 245.2717 256.3627 272.6274 292.8438 315.2629 326.6817 335.5724 351.3260 375.6790 406.6877 414.8735 431.3573 445.2828 456.6169 478.6683 484.7974 512.7847 520.1037 521.8894 559.1958 583.3631 613.1400 635.1476 649.0330 664.7787 695.9528 728.5694 744.4175 762.6778 772.3987 794.9345 806.6836 819.8393 828.9116 841.0573 850.2129 865.0145 877.4644 883.5767 906.9690 910.1060 913.9747 923.0818 946.9741 947.5874 953.2026 979.7344 991.1388 1002.5015 1008.1166 1026.9474 1027.5873 1039.1244 1042.1329 1046.1576 1059.9024 1079.2497 1082.5090 1091.8886 1106.5317 1107.9032 1121.0760 1124.3801 1138.4196 1149.3050 1150.5263 1160.2383 1163.9995 1167.7967 1180.9103 1199.9161 1206.3231 1207.4535 1215.2990 1237.3622 1252.0211 1257.6636 1261.4087 1264.2638 1292.9570 1298.6274 1302.9622 1316.6186 1326.4221 1328.9596 1337.4887 1339.6310 1339.9873 1346.8131 1367.5154 1378.6828 1387.0957 1390.9611 1426.8236 1438.3882 1447.5910 1454.5718 1455.9859 1459.7370 1460.3751 1463.0166 1464.5929 1468.2883 1468.7632 1472.3723 1474.7128 1484.0179 1542.9674 1594.7456 1608.5121 1634.3221 2818.7749 2924.8971 2960.6186 2961.8512 2977.1041 2977.4913 2978.6824 2980.3188 2983.4969 2988.4555 3006.1614 3012.9479 3014.0228 3024.7086 3027.1965 3035.4267 3038.0580 3046.2210 3049.8261 3068.0143 3085.4877 3094.8655 3121.2157 3122.0149 3123.8800 3144.0077 3159.9063 3183.5123 3202.8940
redmass: 4.9430 3.7113 4.5396 3.0658 2.8529 4.1856 3.5323 3.3652 2.6672 2.0138 1.3587 3.6075 3.0682 2.2483 3.5759 2.5243 2.7610 3.6065 3.4655 2.0807 2.6225 2.3474 3.6456 2.6183 3.1368 2.9512 3.3939 3.3761 2.9728 2.4681 2.9424 3.7732 3.0614 4.0767 3.5168 3.3145 3.4040 5.3698 3.7826 2.8057 2.4095 1.6890 1.3695 2.2962 1.5428 1.9865 2.5162 2.5521 1.4340 2.2525 2.9885 1.7999 2.2658 1.8885 1.7153 1.8589 2.1571 2.1193 2.3116 2.1262 1.4808 2.6281 2.1608 1.8129 1.3572 1.9969 2.4460 3.2042 1.3092 1.7171 2.2247 1.9613 1.2401 1.7418 2.0442 1.5278 1.5785 1.7458 2.0410 1.7158 1.4726 1.4677 1.7823 1.8549 1.7218 1.5112 1.5227 1.7379 1.3648 1.3716 1.7976 1.7041 2.0360 1.3937 1.5236 1.4074 1.3250 1.3231 1.4092 1.4170 1.4220 3.9442 1.3162 1.2557 1.7184 3.4185 1.2068 1.0862 1.1604 1.1400 1.1064 1.2825 1.1182 1.0524 1.1287 1.1470 1.2346 1.1474 1.4836 1.0917 5.8090 6.9633 6.0040 1.1034 1.0694 1.0703 1.0633 1.0613 1.0738 1.0640 1.0637 1.0678 1.0374 1.0590 1.0869 1.0948 1.0847 1.0915 1.0959 1.1025 1.1017 1.1021 1.1021 1.0968 1.0514 1.0618 1.0890 1.0912 1.0991 1.0886 1.0949 1.1164 1.1142
irintensity: 0.1594 0.5216 4.1201 0.1221 0.1529 1.3908 0.3910 0.9634 0.9829 1.1170 0.8464 0.1841 0.5629 1.2544 2.8159 0.4794 0.9809 0.2292 0.6844 1.0471 2.8000 1.9703 1.2133 3.5603 0.5091 0.4502 4.4792 5.9650 0.4659 2.7010 0.6082 1.2187 6.1808 15.5604 7.3029 2.6944 3.6979 3.7835 2.7316 2.9714 3.4531 0.2837 1.0024 0.8587 3.6064 13.3772 7.4170 8.2935 28.9718 4.6800 4.0259 8.0181 3.1233 8.5601 7.4715 10.0284 25.4001 9.3576 4.3022 10.1176 2.5601 5.4383 10.2560 1.3408 26.5496 4.7445 4.0029 6.7867 7.8177 1.3959 4.9496 2.4537 0.5250 6.8856 6.7638 2.4870 13.3107 8.5298 8.8563 5.9869 1.4667 10.3212 23.7271 11.2421 5.4763 1.3058 0.9778 10.6732 3.0344 4.2915 144.4155 48.3592 112.6975 5.9297 2.4568 0.7909 4.9695 6.8232 0.5069 1.7470 6.0232 1.0664 48.0734 19.5005 15.9572 16.6146 1.9472 7.7973 40.8763 6.7540 9.5495 9.9943 4.6962 20.0125 11.6240 5.2945 7.4503 6.5577 2.8712 6.5477 76.0439 156.9926 12.4336 1.5013 78.0089 43.0860 33.8561 20.2939 26.0563 46.2188 22.1208 24.0340 3.6987 38.7061 34.2610 24.9801 30.6519 45.2665 58.2462 21.1861 23.2720 120.5735 28.5065 12.8814 27.2002 15.9668 13.1165 9.8891 20.9337 7.5743 4.4190 0.2825 41.7240
temp: 298.150 k
press: 1.00000 atm
elementType: 8 7 6 6 6 6 6 6 6 6 6 6 6 6 6 6 6 6 6 6 6 6 6 6 1 1 1 1 1 1 1 1 1 1 1 1 1 1 1 1 1 1 1 1 1 1 1 1 1 1 1 1 1
symmnumber: 1
zpe: 1203878.8 jmol-1
zpe.correction: 0.458533 hartree
zpe.thermalcorrener: 0.480177 hartree
zpe.thermalcorrenthalpy: 0.481121 hartree
zpe.thermalcorrgfe: 0.408818 hartree
zpe.sumelectzpe: -983.795140 hartree
zpe.sumelectthermal: -983.773497 hartree
zpe.sumelectthermalent: -983.772553 hartree
zpe.sumelectthermalfe: -983.844856 hartree
dipole: 3.7369 2.5959 -0.4666
dipole: 4.5739
quadrupole: -171.9597 -144.1478 -139.1301
quadrupole: -10.1898 4.0251 -4.8712
quadrupole: -20.2139 7.5981 12.6157 -10.1898 4.0251 -4.8712
hfenergy: -984.2536736 hartree
pointgroup: C01 [X(C22H29N1O1)]
dipole: -1.4898524 -0.9849684 -0.2199971 debye
polarizability: 326.0016353|5.9977526|203.8254099|-9.0177973|22.5818344|201.7568284 unknown
InChI: InChI=1S/C22H29NO/c1-15(24)17-7-8-18-13-21-19-4-2-3-9-22(19,20(18)12-17)10-11-23(21)14-16-5-6-16/h7-8,12,16,19,21H,2-6,9-11,13-14H2,1H3
charge 0 multiplicity 1
53 atoms
O  5.911581 1.11966 -0.262101
N  -2.590144 0.964194 -0.309866
C  -0.03127 -0.921188 -0.560657
C  -1.057325 -0.808717 0.584439
C  -1.315258 0.732644 0.410702
C  -0.870294 -0.374507 -1.838768
C  0.43511 -2.387426 -0.759471
C  -0.600745 -1.441959 1.915821
C  1.137424 0.040483 -0.075558
C  -2.380017 0.068616 -1.552745
C  -0.476544 1.487335 1.447476
C  -3.852945 0.686583 0.413108
C  -5.075445 1.17423 -0.354439
C  0.883152 -3.043143 0.571825
C  -0.212275 -2.923617 1.662966
C  0.94834 1.067526 0.945367
C  -6.472057 0.676417 0.043992
C  -5.854301 0.238834 -1.294155
C  2.44065 -0.1342 -0.590899
C  2.071278 1.798509 1.401255
C  3.556353 0.622011 -0.140757
C  3.360453 1.585155 0.881095
C  4.937227 0.439052 -0.70278
C  5.154184 -0.579921 -1.819346
H  -1.973157 -1.364122 0.300365
H  -0.691327 1.047202 -0.436224
H  -0.930749 -1.184023 -2.59406
H  -0.323864 0.456349 -2.324489
H  1.232192 -2.471277 -1.524399
H  -0.431442 -2.955093 -1.158145
H  -1.416934 -1.383963 2.663115
H  0.271492 -0.92034 2.35075
H  -2.764035 0.597294 -2.44502
H  -2.992651 -0.854034 -1.440234
H  -0.643727 1.205729 2.503553
H  -0.572147 2.586956 1.365201
H  -3.985124 -0.403496 0.65125
H  -3.795177 1.226054 1.379123
H  -4.997689 2.221506 -0.668386
H  1.811239 -2.558529 0.933875
H  1.126596 -4.109069 0.396181
H  -1.110703 -3.490861 1.340091
H  0.139918 -3.389953 2.603297
H  -7.303455 1.38673 0.027629
H  -6.537237 -0.07228 0.840997
H  -5.515929 -0.799301 -1.379897
H  -6.267814 0.654322 -2.21784
H  2.595981 -0.89246 -1.365509
H  1.917401 2.569202 2.166479
H  4.225138 2.158571 1.230925
H  4.525646 -0.346871 -2.698989
H  4.88874 -1.59995 -1.483333
H  6.213486 -0.564066 -2.11711
