program: Gaussian 09
title: 000185189
version: EM64L-G09RevD.01
frameworkgroup: C1[X(C12H16N2O2S2)]
method: RPBEPBE
basis: SDD
operation: Freq
keyword: #p
keyword: freq=noraman
keyword: PBEPBE/SDD
title: #p freq=noraman PBEPBE/SDD
converged: YES YES NO NO
title: Mulliken charges:
elementType: S S O O N N C C C C C C C C C C C C H H H H H H H H H H H H H H H H
charge: 0.103474 0.132173 -0.220360 -0.210469 -0.474959 -0.456761 -0.361231 -0.025815 -0.379815 -0.555781 -0.713579 -0.713424 0.209306 0.340336 -0.398705 0.625857 0.082219 -0.662117 0.182956 0.188452 0.192311 0.254278 0.196811 0.246554 0.210750 0.204122 0.229687 0.208570 0.209954 0.206488 0.213140 0.309645 0.332907 0.293025
chargesum: 0.00000
title: Mulliken charges with hydrogens summed into heavy atoms:
elementType: S S O O N N C C C C C C C C C C C C
charge: 0.103474 0.132173 -0.220360 -0.210469 -0.165314 -0.123854 0.010177 0.166496 0.071273 -0.098477 -0.071200 -0.083842 0.209306 0.340336 -0.398705 0.625857 0.082219 -0.369092
polarizability: 2.69157194e+02 3.99534802e+01 1.98190216e+02 -2.07207554e+01 1.57754789e+00 1.21082617e+02
1716.lowfreq: -7.2558 -3.5910 -2.8125 -1.8101 0.0003 0.0006 0.0024 18.6013 30.1706
frequency: -5.2678 18.4786 30.1267 35.3792 64.0295 84.8893 94.8774 114.7143 119.9729 130.6903 172.7994 202.2276 219.5202 238.2330 243.8066 257.0899 304.3798 312.7833 341.4028 375.0880 387.9461 394.3463 414.8464 429.9518 442.8648 461.1795 495.0030 518.6005 555.3452 606.9226 631.2695 663.4048 684.4766 703.6754 737.5716 738.3944 764.5241 769.0580 821.4087 836.4069 883.9578 910.9950 933.5081 947.8270 952.6006 993.4240 1031.1927 1050.4688 1072.9336 1087.7248 1120.8073 1136.4823 1161.1522 1169.7102 1176.2885 1198.0760 1248.5151 1263.9880 1273.7668 1287.4895 1305.5131 1312.3539 1332.1987 1340.7803 1351.2842 1357.6979 1374.9672 1393.0459 1427.8681 1439.1642 1456.9860 1467.4044 1471.9211 1479.2147 1482.6685 1489.0500 1589.1767 1631.4487 1638.4163 1657.1435 2942.8052 2952.7532 2965.1478 2966.5130 2970.8464 2981.2694 2998.8949 3019.3290 3057.5348 3062.4367 3066.6497 3068.2614 3076.2256 3194.0064 3516.4178 3602.5856
redmass: 4.7903 5.7897 3.4868 5.0295 4.9221 3.6355 2.4185 3.2925 3.8726 9.5431 4.9018 1.0995 3.1547 1.2617 3.6719 3.9617 5.4970 8.4091 3.8376 2.4854 7.7342 17.3486 5.3444 2.0881 4.5476 3.6891 1.3513 1.2280 3.6615 5.0213 3.5192 5.8807 8.1103 7.4117 1.3510 1.5768 4.5388 4.7024 2.9364 1.4913 6.3225 1.1891 2.8881 2.4780 1.3972 1.5819 4.6546 4.5158 2.4974 1.7908 2.9057 2.5846 1.2992 2.2259 1.8131 1.7012 1.2959 1.5225 2.9426 1.1451 2.3704 1.3637 1.4181 1.5331 2.5253 1.6015 1.2233 1.2169 1.8322 1.1021 1.0712 1.0447 1.0599 1.0760 1.0686 1.0505 11.6502 7.7242 9.0542 8.9352 1.0605 1.0816 1.0363 1.0582 1.0365 1.0689 1.0960 1.0977 1.0994 1.1000 1.0997 1.0989 1.0986 1.0938 1.0768 1.0807
irintensity: 0.1063 3.0588 0.5161 1.1317 2.4164 3.7638 0.5818 1.2410 2.4297 0.7570 1.3721 0.4020 7.1860 0.3896 1.2823 1.9859 9.3866 4.5548 0.6911 1.8132 2.0617 0.7604 2.9813 0.2541 7.2455 6.2643 49.6693 104.2328 30.8778 5.5670 7.4275 8.0760 17.1841 7.9902 12.1327 74.2088 44.3069 12.2563 0.4994 5.8186 0.4138 4.3655 0.7545 8.4049 0.7534 0.7282 2.1496 29.5985 3.3171 9.9543 26.3023 7.3830 6.3341 79.6887 25.7987 31.0446 39.5051 18.5190 99.0481 2.1910 41.9215 33.5022 3.6862 3.3755 13.8073 8.7811 17.3122 16.6593 332.0044 17.8534 0.7310 2.5811 4.5057 12.3348 5.2538 24.8310 51.2217 81.2222 47.2737 414.0310 21.5346 24.3035 38.5930 23.3839 26.8890 31.0662 36.5103 8.6954 10.9481 9.0660 92.9213 82.0677 46.2803 9.0375 18.3275 64.7637
temp: 298.150 k
press: 1.00000 atm
elementType: 16 16 8 8 7 7 6 6 6 6 6 6 6 6 6 6 6 6 1 1 1 1 1 1 1 1 1 1 1 1 1 1 1 1
symmnumber: 1
zpe: 692390.0 jmol-1
zpe.correction: 0.263717 hartree
zpe.thermalcorrener: 0.282520 hartree
zpe.thermalcorrenthalpy: 0.283465 hartree
zpe.thermalcorrgfe: 0.214317 hartree
zpe.sumelectzpe: -1521.595531 hartree
zpe.sumelectthermal: -1521.576728 hartree
zpe.sumelectthermalent: -1521.575784 hartree
zpe.sumelectthermalfe: -1521.644931 hartree
dipole: -3.2190 -2.2158 -2.5347
dipole: 4.6580
quadrupole: -93.2726 -129.9623 -123.4052
quadrupole: -7.3191 -8.2305 1.4634
quadrupole: 22.2741 -14.4156 -7.8584 -7.3191 -8.2305 1.4634
hfenergy: -1521.8592481 hartree
pointgroup: C01 [X(C12H16N2O2S2)]
dipole: 1.2482484 1.3166369 0.258279 debye
polarizability: 259.6601739|2.4628736|148.2465633|53.2245234|37.2508789|180.52329 unknown
InChI: InChI=1S/C12H16N2O2S2/c1-7(2)4-3-5-9(15)14-10-11-8(6-17-18-11)13-12(10)16/h6-7,13-14H,3-5H2,1-2H3
charge 0 multiplicity 1
34 atoms
S  2.845394 1.563799 1.866239
S  5.026299 0.932263 2.372692
O  -0.602976 -1.264616 0.154804
O  1.798654 -1.486831 -2.343954
N  0.487436 0.657895 -0.584519
N  3.642658 -1.22723 -0.848398
C  -4.509489 0.668256 -0.465153
C  -5.719739 0.474798 0.488319
C  -3.157779 0.194925 0.112207
C  -1.972336 0.539863 -0.816048
C  -5.9593 -1.014656 0.834232
C  -6.994443 1.099792 -0.127776
C  -0.66579 -0.11828 -0.36509
C  1.786291 0.118069 -0.436588
C  2.763576 0.423658 0.487936
C  3.948809 -0.411714 0.246158
C  2.328366 -0.947331 -1.340331
C  5.058135 -0.288995 1.040699
H  -4.438282 1.74546 -0.728057
H  -4.712267 0.128285 -1.415207
H  -5.493544 1.014885 1.433327
H  -3.156761 -0.898208 0.269763
H  -2.993459 0.656827 1.106955
H  -2.189583 0.161806 -1.836414
H  -1.853149 1.638563 -0.905394
H  -6.143453 -1.602928 -0.086026
H  -5.094769 -1.46331 1.354981
H  -6.842721 -1.129094 1.489879
H  -6.849439 2.173488 -0.352535
H  -7.260229 0.588737 -1.073563
H  -7.85728 1.00833 0.558021
H  0.377407 1.586687 -0.998543
H  4.25103 -1.925436 -1.272376
H  5.982336 -0.865456 0.962259
