program: Gaussian 09
title: 000185180
version: EM64L-G09RevD.01
frameworkgroup: C1[X(C10H19N3O4S)]
method: RPBEPBE
basis: SDD
operation: Freq
keyword: #p
keyword: freq=noraman
keyword: PBEPBE/SDD
title: #p freq=noraman PBEPBE/SDD
converged: YES YES NO NO
title: Mulliken charges:
elementType: S O O O O N N N C C C C C C C C C C H H H H H H H H H H H H H H H H H H H
charge: 0.200416 -0.270019 -0.380452 -0.264015 -0.276263 -0.051531 0.070165 -0.363584 0.271163 -0.668137 -0.697169 -0.663561 -0.722964 -0.722635 -0.094203 0.187502 0.281565 -0.769171 0.222640 0.218631 0.230864 0.239856 0.234290 0.197879 0.214517 0.235760 0.218848 0.310565 0.313946 0.273974 0.284162 0.303865 0.317186 0.255238 0.256192 0.218109 0.386372
chargesum: 0.00000
title: Mulliken charges with hydrogens summed into heavy atoms:
elementType: S O O O O N N N C C C C C C C C C C
charge: 0.200416 -0.270019 0.005920 -0.264015 -0.276263 -0.051531 0.070165 -0.046398 0.271163 0.003999 -0.025144 0.005563 -0.098453 -0.164499 0.209663 0.187502 0.281565 -0.039631
polarizability: 2.15123815e+02 6.98341714e+00 1.53866685e+02 8.07150511e+00 -9.59520966e+00 1.32295995e+02
1716.lowfreq: -11.7360 -9.8268 -0.0009 -0.0001 0.0004 3.2922 15.3004 26.3712 35.3599
frequency: 11.2870 23.1728 35.3347 43.6887 53.5005 57.8288 78.1845 85.2294 101.7709 107.8168 129.9648 143.2276 200.5819 211.7008 232.4228 258.9686 263.2025 275.8866 289.2132 314.8987 327.7657 345.5610 352.8151 369.4892 396.8247 405.9080 429.2170 463.8680 500.9724 515.6838 518.6807 565.9252 593.0904 604.3665 619.7875 631.6869 650.0990 654.1366 703.7188 751.3758 792.2793 821.9672 879.6343 914.9904 918.5260 931.1415 950.8945 957.1640 983.7715 1005.8032 1012.1255 1027.3959 1043.4064 1057.0748 1076.5700 1110.5538 1135.1172 1203.2830 1206.1212 1223.9283 1230.8696 1249.7744 1254.1037 1280.5535 1291.2894 1303.2464 1304.2128 1329.9702 1341.7119 1375.9490 1383.3437 1390.1195 1409.5736 1420.2580 1434.2315 1450.2264 1454.6634 1460.0953 1463.4987 1466.1495 1475.4179 1478.6432 1482.8740 1497.4803 1614.1242 1632.0595 2931.2159 2984.4130 2989.1882 3000.0157 3001.7651 3053.1658 3055.6118 3080.5930 3087.0728 3092.5358 3095.8926 3097.8415 3100.5186 3108.5772 3116.1371 3131.6376 3159.1786 3508.9670 3527.4919
redmass: 4.7948 6.1134 6.2756 3.4716 7.1287 5.7820 3.4358 1.3835 2.9705 6.2770 5.7740 6.4343 1.1348 4.5946 5.7857 1.4494 1.6870 2.9816 1.2097 2.8715 3.3236 2.8707 4.9098 2.4649 2.4809 3.1145 3.5751 3.2955 4.2096 3.7450 3.4951 3.4089 3.5144 2.4647 2.4559 2.0395 2.3302 2.7001 3.8653 2.5500 2.8716 2.5992 3.7978 2.0098 2.0393 1.6574 4.1728 1.2059 2.0190 1.8117 2.0824 1.4072 1.6573 1.8096 1.9457 3.4750 2.2699 1.6815 1.6044 1.5241 2.9863 1.7606 2.3163 1.4898 1.4988 1.4864 1.5005 8.3721 1.8921 1.1917 1.2005 1.2331 1.2023 1.0978 1.1003 1.0798 1.0513 1.3808 1.0477 1.0490 1.4213 1.0566 1.0581 1.0599 6.4682 8.8802 1.0788 1.0350 1.0349 1.0361 1.0367 1.0593 1.0589 1.0997 1.0990 1.1011 1.1005 1.0986 1.0997 1.1003 1.0998 1.1051 1.1059 1.0640 1.0784
irintensity: 1.4019 1.5715 2.2287 1.7205 2.7735 4.2463 9.9172 1.0956 1.6579 0.4319 6.4788 1.9311 1.5385 4.9323 5.8217 0.6142 0.3569 5.9639 1.1630 1.0481 0.0745 2.0673 1.5962 2.5249 4.0292 3.3159 8.5605 2.4078 5.0653 26.6348 18.2054 2.2340 62.5732 50.7838 24.5195 71.5157 44.1090 84.2156 23.2365 1.5868 10.9530 0.7858 58.3491 20.4476 24.2063 4.3557 10.3292 0.5571 36.6995 18.2071 43.4719 0.2987 4.7474 42.2224 164.2024 91.9735 8.7101 10.3756 83.3781 8.7898 20.1702 52.4567 15.3776 30.0546 34.1470 53.0506 60.3871 64.5035 26.9827 20.5703 16.1597 75.2997 20.6674 30.1853 10.8963 42.0615 2.2422 218.4586 1.9368 1.9889 102.0999 10.1192 18.1764 21.5698 173.8175 292.5528 59.6085 18.1033 16.7582 8.0589 19.4739 8.8700 5.1169 7.7574 52.4773 13.5751 12.9303 10.8705 58.8164 13.9735 20.9142 2.3097 10.2712 36.5792 47.0238
temp: 298.150 k
press: 1.00000 atm
elementType: 16 8 8 8 8 7 7 7 6 6 6 6 6 6 6 6 6 6 1 1 1 1 1 1 1 1 1 1 1 1 1 1 1 1 1 1 1
symmnumber: 1
zpe: 772589.4 jmol-1
zpe.correction: 0.294264 hartree
zpe.thermalcorrener: 0.315932 hartree
zpe.thermalcorrenthalpy: 0.316876 hartree
zpe.thermalcorrgfe: 0.240538 hartree
zpe.sumelectzpe: -1254.199248 hartree
zpe.sumelectthermal: -1254.177580 hartree
zpe.sumelectthermalent: -1254.176636 hartree
zpe.sumelectthermalfe: -1254.252974 hartree
dipole: -0.6265 -2.9942 -0.7251
dipole: 3.1438
quadrupole: -123.3789 -123.6342 -110.8955
quadrupole: 21.5153 -16.2514 7.0389
quadrupole: -4.0760 -4.3314 8.4073 21.5153 -16.2514 7.0389
hfenergy: -1254.4935117 hartree
pointgroup: C01 [X(C10H19N3O4S1)]
dipole: -0.1788003 -1.2073858 0.2002371 debye
polarizability: 210.0980109|17.2258817|145.0952584|15.2128442|-11.7058014|146.0932259 unknown
InChI: InChI=1S/C10H19N3O4S/c1-7(14)11-8(9(15)16)5-18-6-13(12-17)10(2,3)4/h8,11,15H,5-6H2,1-4H3
charge 0 multiplicity 1
37 atoms
S  -0.295028 1.38972 -0.328885
O  -2.55657 1.712966 -2.543005
O  2.789009 -1.841881 -0.406845
O  0.612875 -2.119431 0.332619
O  4.396188 0.63102 1.920223
N  -2.832638 0.240558 -0.875102
N  -3.407448 1.157871 -1.748379
N  2.78304 0.813816 0.261583
C  -3.745897 -0.470927 0.09508
C  -3.819426 -1.971162 -0.30243
C  -5.158609 0.157202 0.031891
C  -3.175988 -0.321459 1.530044
C  -1.406344 -0.042536 -0.980543
C  0.4893 0.626523 1.226971
C  1.845435 -0.059505 0.958653
C  1.652601 -1.418927 0.269605
C  4.0306 1.103062 0.79998
C  4.915748 2.012046 -0.040415
H  -2.82802 -2.457998 -0.264787
H  -4.482545 -2.507346 0.399764
H  -4.228974 -2.082936 -1.32157
H  -5.607379 0.059749 -0.969057
H  -5.135635 1.229763 0.286556
H  -5.800695 -0.367438 0.762275
H  -2.21721 -0.856488 1.647272
H  -3.0288 0.742327 1.785661
H  -3.889295 -0.760306 2.249918
H  -1.132501 -0.122828 -2.043934
H  -1.13944 -0.951242 -0.42855
H  -0.224623 -0.076523 1.680314
H  0.640631 1.479171 1.90829
H  2.340856 -0.282365 1.932586
H  2.479419 1.217064 -0.628361
H  5.273864 2.84723 0.584514
H  5.804022 1.443836 -0.367855
H  4.4061 2.418088 -0.930634
H  2.632977 -2.752614 -0.779349
