program: Gaussian 09
title: 000187741
version: EM64L-G09RevD.01
frameworkgroup: C1[X(C23H22N2O3)]
method: RPBEPBE
basis: SDD
operation: Freq
keyword: #p
keyword: freq=noraman
keyword: PBEPBE/SDD
title: #p freq=noraman PBEPBE/SDD
converged: YES YES NO NO
title: Mulliken charges:
elementType: O O O N N C C C C C C C C C C C C C C C C C C C C C C C H H H H H H H H H H H H H H H H H H H H H H
charge: -0.230659 -0.449031 -0.415522 -0.098295 -0.461933 0.204522 0.122495 -0.134858 -0.361461 -0.461329 -0.007597 -0.633719 -0.586083 -0.401191 0.400278 0.210890 0.131855 0.105121 0.137059 -0.646348 -0.427314 0.112054 0.201541 -0.366668 -0.424224 -0.369849 -0.255071 -0.218925 0.228772 0.254431 0.198460 0.236156 0.243845 0.266870 0.220098 0.229659 0.207589 0.217254 0.344203 0.317840 0.216750 0.204929 0.223089 0.234422 0.212180 0.234108 0.234184 0.355302 0.221396 0.222725
chargesum: 0.00000
title: Mulliken charges with hydrogens summed into heavy atoms:
elementType: O O O N N C C C C C C C C C C C C C C C C C C C C C C C
charge: -0.230659 -0.104828 -0.060219 -0.098295 -0.144093 0.204522 0.122495 0.093915 -0.107030 -0.026713 -0.007597 -0.123004 -0.136325 0.023652 0.400278 0.210890 0.131855 0.105121 0.137059 -0.001581 -0.192892 0.112054 0.201541 -0.154488 -0.190116 -0.135666 -0.033675 0.003800
polarizability: 3.21128368e+02 1.54605762e+00 2.52559330e+02 -4.45487320e+00 -1.45832077e+01 2.24523340e+02
1716.lowfreq: -3.5360 -0.0007 -0.0006 -0.0005 3.7564 9.3995 30.3265 46.3371 69.8936
frequency: 30.1940 46.2104 69.8780 92.2008 101.8736 127.6530 152.5763 170.9464 188.1156 210.6637 224.8258 235.4073 238.1181 246.0459 282.8441 285.5293 290.8267 305.0974 317.1804 328.4890 344.2235 348.9426 360.4383 368.8114 398.0628 425.1773 431.9992 443.6162 456.5449 485.9844 513.0249 525.6911 544.1084 555.1448 563.1262 567.9578 577.1189 584.6790 589.9936 601.6737 621.6606 644.0669 668.2025 680.8350 722.7338 731.0028 742.0668 752.2158 759.1272 763.4176 774.5734 778.4792 808.0105 841.1835 851.7099 855.8235 874.2899 884.9285 898.1544 917.7292 932.1637 933.8745 956.5767 972.8668 977.6304 996.2630 1001.1036 1010.5816 1033.8910 1042.4746 1064.0278 1074.5203 1080.6929 1102.4006 1114.0617 1115.4502 1140.1513 1143.0543 1157.5629 1160.9984 1169.9921 1175.8569 1180.4927 1206.3828 1211.5755 1215.4062 1220.3877 1229.5198 1233.4915 1254.8671 1262.4341 1262.8912 1270.1371 1273.7062 1282.3852 1296.3669 1319.8039 1334.4066 1338.3790 1344.2693 1359.3404 1366.1156 1380.5540 1405.0042 1410.5883 1434.8945 1438.1149 1446.3001 1453.3478 1457.8229 1459.8847 1463.4400 1465.8773 1479.0893 1484.9993 1489.7469 1490.8722 1576.1235 1591.0425 1612.9979 1631.7587 1642.3895 2866.1474 2924.4830 2933.2566 2960.8529 2992.3000 2992.8366 3005.8779 3006.2014 3031.6238 3041.5088 3046.7548 3060.3784 3061.6205 3107.7324 3124.6531 3132.3271 3138.9481 3145.9113 3163.2714 3512.9355 3580.1646 3601.3082
redmass: 5.4426 3.7441 3.9497 4.8664 5.6142 4.5414 3.9858 2.4118 4.2345 2.3774 2.5766 2.5342 4.5185 4.9660 3.1562 2.8650 3.0904 1.6518 2.1813 4.1392 3.3590 3.5953 1.4819 2.8943 4.0203 3.2513 3.1375 3.4663 5.0064 3.8083 2.7163 1.3362 4.4156 5.0328 4.3403 4.3413 4.1173 4.5910 5.4154 5.4142 5.1512 3.4387 5.2713 5.8666 4.2061 4.9690 3.9376 1.4957 3.8713 3.7212 2.3468 2.6946 4.0479 2.6074 1.5525 4.5781 3.5829 2.5413 1.3907 3.8559 2.5787 1.6385 2.2057 1.3050 2.8287 2.7341 2.8040 2.0391 2.6658 2.1461 4.0745 2.3028 2.0936 2.1082 1.5398 1.6391 3.9443 1.5631 1.8453 1.9247 1.5098 1.8497 1.4521 1.7110 1.3929 1.5452 1.5037 1.6378 1.8382 1.7208 1.7169 1.6804 1.6659 1.9739 1.9229 1.8010 1.5383 1.4726 2.0869 1.6009 1.9550 1.7352 1.3550 7.3535 3.4658 2.9820 1.1962 3.8097 1.1554 1.1314 1.1556 4.9385 1.0520 1.0666 3.0829 1.0855 3.3917 7.0115 6.3293 8.5483 7.1739 7.9964 1.0545 1.0692 1.0790 1.0694 1.0597 1.0709 1.0813 1.0772 1.0927 1.0999 1.0873 1.1019 1.1003 1.0874 1.0849 1.0890 1.0951 1.0953 1.1002 1.0656 1.0660 1.0806
irintensity: 0.2043 0.3249 0.0990 0.7729 1.2309 0.4557 1.8341 5.4700 1.1118 5.6146 4.7514 2.1021 2.4503 4.9229 2.4547 13.2231 16.9284 37.4559 68.2024 5.0788 1.4988 1.2038 45.3631 20.4891 4.7544 6.6653 1.0813 11.4343 4.6817 1.4780 27.1814 62.2416 4.1022 3.2857 2.4082 9.1305 1.3038 3.9332 1.4997 6.3023 3.0744 4.3605 7.6359 2.9959 2.9920 5.7553 14.1011 102.5390 1.1954 19.2978 42.3372 93.7356 8.9973 10.1233 1.6394 5.8462 37.2899 6.0070 2.3634 14.2215 11.8078 1.9524 39.3473 0.0418 42.0277 23.3125 16.6890 17.2354 26.7110 83.4209 15.4249 22.1969 42.4003 3.8418 7.8399 23.9416 19.7607 50.9778 29.1389 27.2607 11.5779 5.8063 26.6010 65.3143 8.1738 5.3532 13.4755 33.3006 18.9877 36.1559 14.1653 15.7189 36.8953 53.6487 4.7545 4.8937 16.3458 7.7203 91.0248 4.5790 23.2781 13.3460 6.4846 0.6694 6.3249 28.0851 4.2058 16.6180 26.0102 12.8043 13.4125 7.9692 16.1604 5.3724 1.1221 7.7862 67.2971 6.7854 2.4472 17.5047 1.9457 25.6980 141.1619 71.1516 54.1605 53.6286 24.0924 20.0369 72.7776 36.0504 27.2128 11.6489 21.4623 36.6688 38.8303 17.6670 1.0669 2.8645 21.2895 31.6018 35.7924 6.8211 36.3902 62.8160
temp: 298.150 k
press: 1.00000 atm
elementType: 8 8 8 7 7 6 6 6 6 6 6 6 6 6 6 6 6 6 6 6 6 6 6 6 6 6 6 6 1 1 1 1 1 1 1 1 1 1 1 1 1 1 1 1 1 1 1 1 1 1
symmnumber: 1
zpe: 1054303.0 jmol-1
zpe.correction: 0.401563 hartree
zpe.thermalcorrener: 0.423667 hartree
zpe.thermalcorrenthalpy: 0.424612 hartree
zpe.thermalcorrgfe: 0.352743 hartree
zpe.sumelectzpe: -1222.818973 hartree
zpe.sumelectthermal: -1222.796868 hartree
zpe.sumelectthermalent: -1222.795924 hartree
zpe.sumelectthermalfe: -1222.867793 hartree
dipole: 0.2883 0.1512 0.9577
dipole: 1.0115
quadrupole: -154.9653 -157.6591 -151.6985
quadrupole: 0.5632 -8.4539 3.1984
quadrupole: -0.1910 -2.8848 3.0758 0.5632 -8.4539 3.1984
hfenergy: -1223.2205357 hartree
pointgroup: C01 [X(C23H22N2O3)]
dipole: 0.1184677 0.0819956 0.3709756 debye
polarizability: 320.8218623|2.8125323|251.0737955|-5.9266724|-16.1360685|226.3153807 unknown
InChI: InChI=1S/C23H22N2O3/c1-25-9-8-22-18-12-6-7-16(26)20(18)28-21(22)19-14(11-23(22,27)17(25)10-12)13-4-2-3-5-15(13)24-19/h2-7,17,21,24,26-27H,8-11H2,1H3
charge 0 multiplicity 1
50 atoms
O  -0.228123 1.771667 -1.663512
O  -0.548915 -2.817194 -0.622997
O  -0.804635 4.410407 -0.506737
N  -3.319886 -1.979735 0.095952
N  2.604299 0.415701 -1.493173
C  -1.131611 -0.374688 -0.847006
C  -0.81066 -1.559009 0.116553
C  -2.109746 -1.794378 0.952682
C  0.056968 0.250819 -1.648944
C  -2.315307 -0.746266 -1.814959
C  -1.499067 0.804588 0.051519
C  0.427085 -1.278279 1.017666
C  -2.395328 -0.61295 1.934656
C  -3.118331 -1.985044 -1.366852
C  -2.153067 0.748946 1.292013
C  1.367107 -0.018709 -0.992091
C  1.56819 -0.734221 0.191638
C  -1.011974 1.994748 -0.509354
C  2.994395 -0.742246 0.444088
C  -4.201734 -3.057229 0.570024
C  -2.426712 1.993698 1.915413
C  -1.28621 3.235499 0.097764
C  3.619261 -0.002102 -0.626659
C  -2.022344 3.210784 1.314138
C  3.808488 -1.291403 1.470128
C  5.016044 0.197541 -0.687555
C  5.201397 -1.095489 1.412007
C  5.797906 -0.358464 0.345007
H  -1.924278 -2.716302 1.548212
H  0.04982 -0.010141 -2.72059
H  -1.915721 -0.948258 -2.826516
H  -2.98287 0.130325 -1.891935
H  0.704377 -2.227124 1.515381
H  0.178955 -0.555093 1.815225
H  -1.763526 -0.702626 2.843502
H  -3.444294 -0.7117 2.270477
H  -4.11947 -1.952367 -1.840214
H  -2.605752 -2.90904 -1.715341
H  0.372265 -2.754031 -0.989958
H  2.716235 1.038064 -2.291437
H  -4.42361 -2.923903 1.645326
H  -3.765919 -4.078317 0.433394
H  -5.162271 -3.019203 0.02352
H  -2.940699 2.021979 2.88307
H  -2.248469 4.161351 1.816394
H  3.360873 -1.854844 2.296641
H  5.480961 0.76252 -1.503014
H  -1.051642 5.19995 0.036038
H  5.842774 -1.511691 2.196692
H  6.885064 -0.222544 0.32973
