program: Gaussian 09
title: 000187708
version: EM64L-G09RevD.01
frameworkgroup: C1[X(C18H32N2O2)]
method: RPBEPBE
basis: SDD
operation: Freq
keyword: #p
keyword: freq=noraman
keyword: PBEPBE/SDD
title: #p freq=noraman PBEPBE/SDD
converged: YES YES NO NO
title: Mulliken charges:
elementType: O O N N C C C C C C C C C C C C C C C C C C H H H H H H H H H H H H H H H H H H H H H H H H H H H H H H H H
charge: -0.264293 -0.285094 -0.290638 -0.053352 -0.385687 -0.381020 -0.384624 -0.373721 -0.369853 -0.352792 -0.363357 -0.356691 -0.406350 -0.695797 -0.181356 -0.351572 -0.347774 -0.296957 0.084662 -0.689322 0.206051 -0.232857 0.195957 0.194049 0.194632 0.192698 0.196418 0.200940 0.189655 0.190611 0.195519 0.199663 0.188644 0.188015 0.220551 0.202798 0.194927 0.194903 0.222806 0.231796 0.215892 0.209936 0.209979 0.337953 0.288579 0.208054 0.224468 0.193283 0.200495 0.225583 0.220562 0.214092 0.216659 0.212277
chargesum: 0.00000
title: Mulliken charges with hydrogens summed into heavy atoms:
elementType: O O N N C C C C C C C C C C C C C C C C C C
charge: -0.264293 -0.285094 0.047315 -0.053352 0.004318 0.006311 0.012734 0.006545 0.025329 0.023866 0.059993 0.033139 0.048253 -0.059989 0.107224 0.080950 0.046003 0.149188 0.084662 -0.046294 0.206051 -0.232857
polarizability: 3.24397016e+02 -9.41255590e+00 1.99380843e+02 -2.02310011e+01 -9.38657740e+00 1.72353792e+02
1716.lowfreq: -27.1195 -21.2573 -5.4772 -0.0017 -0.0005 -0.0003 2.2635 6.8012 14.8143
frequency: -26.1462 -5.2371 14.1456 20.6351 23.4081 30.4470 48.1387 49.6825 61.2901 63.6505 74.8011 95.4711 99.7211 106.7862 108.4568 117.8798 128.4189 142.7300 146.3590 154.3298 176.9158 202.3344 222.6753 227.4080 229.7954 262.9635 280.2830 302.3183 322.3110 334.6597 361.2429 401.5742 417.8959 438.8327 484.1626 488.9306 493.5555 520.9564 560.3187 686.9180 718.4793 720.1661 723.6788 727.2997 733.6255 743.2913 751.5246 772.8201 791.5772 808.5714 842.5558 887.2657 893.4051 901.0034 914.3916 936.0457 963.8452 978.8791 979.0669 997.5810 1006.1675 1021.9661 1025.6412 1035.9885 1053.5719 1063.1714 1070.2183 1075.4103 1079.1439 1082.0951 1088.0934 1115.7205 1122.4377 1150.5643 1165.1495 1183.6036 1208.6662 1210.2246 1225.8526 1238.1889 1243.9885 1260.1494 1267.6732 1275.6641 1278.9459 1280.7563 1285.4267 1287.9285 1289.2447 1291.0884 1297.3052 1300.6397 1308.4471 1331.8600 1334.8578 1342.5119 1350.4598 1353.7533 1357.2907 1358.6865 1364.3203 1371.8923 1386.7708 1391.4717 1449.9875 1453.8415 1459.5134 1459.8353 1462.9809 1464.1130 1466.4162 1470.2783 1471.5026 1476.4260 1476.5878 1477.0334 1477.7696 1482.2430 1486.7094 1488.5660 1488.6407 1596.0841 1649.6059 2151.7626 2949.2647 2949.7620 2952.3278 2953.1942 2957.8202 2963.7273 2966.8895 2967.9128 2971.4360 2974.9313 2975.3995 2982.9152 2987.5730 2989.1706 2992.3764 2994.3916 3003.5168 3011.7320 3015.9016 3019.9126 3027.2956 3036.1568 3043.3542 3051.6944 3065.9218 3067.7840 3070.8594 3073.2181 3075.2131 3099.9510 3144.4908 3486.4845
redmass: 1.9102 4.0500 3.5619 3.4611 3.9004 4.9334 2.3398 2.6890 1.6888 3.0505 5.1869 2.7909 3.4332 2.4576 2.3067 4.1337 2.4509 2.1328 2.2632 4.2810 4.5295 3.6201 3.6539 1.1164 1.1309 4.8700 3.1202 2.7085 3.6198 4.7804 3.9115 2.9576 3.1444 3.8865 4.4538 4.0847 5.3609 4.2519 5.8483 2.3845 3.9074 1.0619 1.0838 2.8708 1.1246 1.0918 1.1682 2.5766 1.3412 1.3564 1.2750 1.9021 2.1974 1.5470 2.2450 1.1935 1.5309 1.3619 2.6541 3.9973 2.8049 2.3697 1.6511 3.1321 3.2898 3.0037 2.4078 2.5175 2.1241 2.3886 3.2096 2.4643 2.8927 1.8814 1.7666 1.8070 1.2777 1.5438 1.3274 1.4890 1.2974 1.5641 1.2828 1.3086 1.2435 1.1585 1.0757 1.0716 1.1365 1.2870 1.0930 1.1611 1.3232 1.5847 1.4489 1.5156 1.5069 1.6639 1.6335 1.6124 1.8005 1.4857 1.2167 1.2173 1.4653 1.2757 1.0773 1.0720 1.0762 1.0660 1.0818 1.0690 1.0820 1.0453 1.0461 1.0810 1.0605 1.0884 1.0904 1.0969 1.0851 8.9887 4.7304 12.5975 1.0586 1.0585 1.0591 1.0589 1.0593 1.0589 1.0586 1.0588 1.0363 1.0600 1.0364 1.0963 1.0941 1.0673 1.0594 1.0984 1.1018 1.1002 1.1034 1.0578 1.1035 1.1035 1.1041 1.1030 1.1044 1.1007 1.0992 1.1011 1.0995 1.1083 1.0926 1.0763
irintensity: 0.0209 0.0758 0.1716 0.0959 1.0083 0.3336 0.4322 0.7088 0.0358 0.0047 3.2026 1.6541 1.4010 0.2536 0.4228 2.2621 1.0955 0.0177 0.5313 0.6885 0.3680 0.6487 0.6891 0.0022 0.5532 2.5396 13.8726 1.1248 4.9703 2.2610 5.6962 3.3257 1.3336 1.5630 3.9451 3.2883 0.8005 5.1368 9.4452 27.2328 5.8191 15.3705 1.0534 76.3356 16.1989 9.1769 1.0297 1.5504 2.7357 0.9996 0.8147 5.1430 10.1633 3.8461 14.5117 0.8647 13.0041 24.2797 4.5390 17.9133 16.0783 16.1909 5.3796 48.8020 46.5154 7.3917 3.8424 2.3732 10.4091 0.2749 247.9509 8.8333 23.0675 246.1234 20.4568 18.0896 32.0947 56.8136 11.1284 100.8513 2.1663 115.5761 11.9956 11.6494 25.4198 29.3728 2.2239 2.0308 2.2794 25.2109 0.2097 2.3243 2.4958 1.1695 7.3454 6.8655 6.0317 6.3396 2.3543 33.0993 0.6715 2.8027 11.1476 9.8595 10.5436 48.0387 0.1103 0.0250 0.1385 0.6565 3.1670 0.1062 0.8246 13.9207 10.3198 6.6029 5.6120 1.5466 6.3946 29.5894 27.8330 378.4059 589.3512 73.5467 0.0889 0.0366 0.0551 4.5255 1.0152 42.4490 32.9027 172.6794 38.9417 35.1322 32.5697 0.1474 5.6146 61.0124 20.8781 3.3159 0.8802 9.1722 1.9988 54.1802 1.3457 16.7028 181.0178 6.2648 57.2506 104.2699 55.1682 63.0921 55.1430 34.8515 0.9452 41.5251
temp: 298.150 k
press: 1.00000 atm
elementType: 8 8 7 7 6 6 6 6 6 6 6 6 6 6 6 6 6 6 6 6 6 6 1 1 1 1 1 1 1 1 1 1 1 1 1 1 1 1 1 1 1 1 1 1 1 1 1 1 1 1 1 1 1 1
symmnumber: 1
zpe: 1236657.3 jmol-1
zpe.correction: 0.471018 hartree
zpe.thermalcorrener: 0.497286 hartree
zpe.thermalcorrenthalpy: 0.498230 hartree
zpe.thermalcorrgfe: 0.409527 hartree
zpe.sumelectzpe: -963.299653 hartree
zpe.sumelectthermal: -963.273385 hartree
zpe.sumelectthermalent: -963.272441 hartree
zpe.sumelectthermalfe: -963.361145 hartree
dipole: -4.4128 -1.8224 2.1995
dipole: 5.2566
quadrupole: -134.6746 -151.1990 -137.3423
quadrupole: -15.1334 0.0147 7.9200
quadrupole: 6.3974 -10.1270 3.7297 -15.1334 0.0147 7.9200
hfenergy: -963.7706712 hartree
pointgroup: C01 [X(C18H32N2O2)]
dipole: 1.7070812 1.1504542 -0.1985945 debye
polarizability: 324.0270313|15.8859368|188.0857966|17.456806|-16.0787398|184.0188228 unknown
InChI: InChI=1S/C18H32N2O2/c1-3-5-7-8-9-10-11-12-13-20-16-17(15-19)18(21)22-14-6-4-2/h16,20H,3-14H2,1-2H3
charge 0 multiplicity 1
54 atoms
O  -5.308783 -1.268772 -0.085815
O  -4.154015 0.552939 -1.007907
N  -0.955429 -0.147139 1.645988
N  -3.34627 -2.721137 2.518772
C  5.313699 0.622624 0.425442
C  6.485964 -0.161016 -0.206815
C  3.97234 -0.142002 0.366195
C  7.838646 0.580985 -0.120227
C  2.794131 0.638123 0.991923
C  9.007845 -0.205273 -0.755067
C  1.47186 -0.161304 0.96959
C  10.365114 0.527804 -0.656165
C  0.297031 0.630854 1.588568
C  11.526286 -0.264614 -1.294808
C  -2.010521 0.027994 0.810063
C  -7.440465 -0.009014 -0.393786
C  -8.684391 0.188997 -1.292376
C  -6.45121 -1.007482 -1.009539
C  -3.174949 -0.745116 0.797843
C  -9.69428 1.186593 -0.685206
C  -4.221635 -0.397311 -0.179751
C  -3.313219 -1.830559 1.71495
H  5.205062 1.599817 -0.090132
H  5.556869 0.854584 1.483604
H  6.252725 -0.374697 -1.270944
H  6.578349 -1.147604 0.294128
H  4.08449 -1.115137 0.888436
H  3.732879 -0.38254 -0.690371
H  8.07382 0.79046 0.944514
H  7.748792 1.569277 -0.618291
H  3.047496 0.904642 2.039499
H  2.659708 1.596899 0.448886
H  8.7790 -0.40685 -1.822668
H  9.092483 -1.197504 -0.263901
H  1.213042 -0.439039 -0.070996
H  1.60787 -1.110722 1.526734
H  10.279669 1.519773 -1.145463
H  10.594261 0.727004 0.410773
H  0.103899 1.547643 1.00199
H  0.564483 0.9504 2.614941
H  12.484265 0.281063 -1.212044
H  11.653554 -1.247347 -0.802423
H  11.33531 -0.451195 -2.368615
H  -0.997692 -0.923439 2.31603
H  -1.946119 0.849797 0.087069
H  -7.753519 -0.375973 0.602854
H  -6.931045 0.961833 -0.244664
H  -9.182803 -0.788584 -1.454896
H  -8.364589 0.549145 -2.291254
H  -6.053904 -0.632515 -1.970356
H  -6.908487 -2.001721 -1.146279
H  -9.231211 2.18096 -0.543602
H  -10.576729 1.313434 -1.338617
H  -10.050573 0.838161 0.302291
