program: Gaussian 09
title: 000187695
version: EM64L-G09RevD.01
frameworkgroup: C1[X(C9H21O5PSi)]
method: RPBEPBE
basis: SDD
operation: Freq
keyword: #p
keyword: freq=noraman
keyword: PBEPBE/SDD
title: #p freq=noraman PBEPBE/SDD
converged: YES YES NO NO
title: Mulliken charges:
elementType: P Si O O O O O C C C C C C C C C H H H H H H H H H H H H H H H H H H H H H
charge: 1.303201 1.265557 -0.236701 -0.498251 -0.529740 -0.245698 -0.606287 -0.769314 -1.010576 -1.022753 -1.019436 -0.287751 -0.852704 0.326405 -0.508609 -0.484003 0.260692 0.251195 0.238178 0.239001 0.233154 0.238669 0.238915 0.230843 0.231879 0.241146 0.236343 0.233901 0.237638 0.293691 0.311061 0.231177 0.262816 0.244007 0.229854 0.254017 0.238483
chargesum: 0.00000
title: Mulliken charges with hydrogens summed into heavy atoms:
elementType: P Si O O O O O C C C C C C C C C
charge: 1.303201 1.265557 -0.236701 -0.498251 -0.529740 -0.245698 -0.606287 -0.257427 -0.300243 -0.314326 -0.310068 0.183788 -0.247951 0.326405 0.229391 0.238351
polarizability: 1.96448416e+02 2.09784421e+00 1.44233441e+02 1.13724299e+00 -4.48071701e+00 1.52257183e+02
1716.lowfreq: -14.3069 -11.0938 -3.0397 -0.0011 -0.0009 -0.0005 9.1960 13.4631 19.8433
frequency: -9.6156 13.2484 19.8279 40.9878 53.9570 68.3632 72.0442 75.6993 98.8425 102.9268 113.3175 118.2970 129.8300 143.3546 146.4336 161.5423 171.7474 183.4302 184.2281 204.2464 208.7030 227.4019 244.9893 275.7466 295.3848 311.4154 325.9452 363.9325 414.2944 432.5591 538.2579 580.1878 610.8070 646.9443 676.0688 684.0437 691.8884 707.8959 713.3833 738.5830 763.4280 773.3535 810.6364 817.5927 892.8346 898.9121 902.6330 919.8578 935.3987 956.0307 968.4396 977.0149 1043.2394 1052.4704 1114.2429 1116.9011 1122.3620 1129.2880 1135.4241 1195.7467 1210.0761 1231.3212 1252.4194 1286.3424 1294.0231 1296.8832 1308.1993 1351.9937 1404.2810 1424.8625 1427.5340 1439.0199 1443.0537 1445.7467 1447.7968 1455.8957 1456.2210 1458.4986 1459.4136 1461.7185 1463.5097 1475.2666 1481.9233 1621.8120 2978.0740 2978.9113 2980.7840 2981.4265 2985.4301 2993.9908 3027.0149 3055.3818 3061.7878 3077.9039 3080.1440 3082.3316 3082.6380 3084.9960 3085.6472 3086.1602 3087.1690 3108.7951 3124.3135 3126.9313 3143.9888
redmass: 4.3695 3.9130 4.9495 3.5622 3.3780 2.8928 1.2732 2.1969 3.9363 1.0699 3.7569 3.8872 1.0267 1.1230 1.0277 4.1008 4.5596 2.5061 2.6002 3.9252 3.4499 2.4034 4.7570 3.2468 3.6422 5.5327 5.6092 5.6639 4.1394 4.4669 7.8529 4.1606 6.0652 9.3526 4.9364 2.7669 3.3530 1.5256 2.1370 1.1688 5.6745 2.8743 1.3548 1.6522 1.4758 1.5440 2.0263 1.8601 3.4280 10.9904 8.5881 1.6737 4.6344 4.5795 1.3237 1.2430 1.6407 1.2809 1.3718 1.2868 1.3156 1.7892 1.4584 1.1248 1.1955 1.1910 1.1896 1.2818 1.1093 1.1200 1.1203 1.0878 1.0545 1.0542 1.0585 1.0876 1.0570 1.0526 1.0504 1.0513 1.0543 1.0527 1.0539 8.7537 1.0345 1.0344 1.0344 1.0296 1.0296 1.0581 1.0587 1.1007 1.0570 1.0982 1.0976 1.0984 1.0985 1.0977 1.0981 1.1054 1.1057 1.1079 1.1028 1.1037 1.1067
irintensity: 1.6980 0.6633 1.2078 0.4589 1.0205 1.2679 0.6233 2.6389 0.3873 0.0729 7.3799 1.8410 0.0285 0.3161 0.0716 7.1954 4.5771 3.4140 5.0767 2.2068 0.3649 5.9076 16.7500 15.9349 2.8020 16.8109 26.0571 5.5709 13.5248 23.6487 6.7306 7.8192 80.1054 100.3069 63.4389 7.6338 7.6554 6.0644 4.7293 0.0555 24.5872 33.3610 17.0518 26.6642 39.6793 81.5213 17.0389 289.2678 3.4925 128.0778 229.4716 78.7641 48.0782 66.0711 48.9458 1.4466 170.5058 2.7467 23.4724 18.7174 49.7901 147.2918 134.3988 24.0658 41.9541 37.8358 12.8313 2.8082 28.0721 9.5104 4.0853 1.0621 0.3158 0.1420 0.1436 14.0097 13.4682 10.8379 14.4410 9.7507 24.7650 17.2394 5.9403 169.0087 16.4003 14.7118 10.9808 45.0166 58.3442 3.7612 30.5206 2.0683 0.5448 1.2772 38.1574 4.9222 2.8548 46.3690 19.6704 19.5707 21.1821 13.5198 11.3795 14.8602 0.5273
temp: 298.150 k
press: 1.00000 atm
elementType: 15 14 8 8 8 8 8 6 6 6 6 6 6 6 6 6 1 1 1 1 1 1 1 1 1 1 1 1 1 1 1 1 1 1 1 1 1
symmnumber: 1
zpe: 772358.1 jmol-1
zpe.correction: 0.294176 hartree
zpe.thermalcorrener: 0.317268 hartree
zpe.thermalcorrenthalpy: 0.318212 hartree
zpe.thermalcorrgfe: 0.238890 hartree
zpe.sumelectzpe: -1360.978710 hartree
zpe.sumelectthermal: -1360.955618 hartree
zpe.sumelectthermalent: -1360.954674 hartree
zpe.sumelectthermalfe: -1361.033996 hartree
dipole: 0.2471 -1.8780 0.9243
dipole: 2.1077
quadrupole: -88.3900 -119.3695 -112.7371
quadrupole: -2.6258 5.1899 5.5474
quadrupole: 18.4422 -12.5373 -5.9049 -2.6258 5.1899 5.5474
hfenergy: -1361.2728859 hartree
pointgroup: C01 [X(C9H21O5P1Si1)]
dipole: 0.3378914 0.4883364 -0.5787601 debye
polarizability: 191.7212781|-8.1090516|143.4542319|11.4865779|-2.0204843|157.7635301 unknown
InChI: InChI=1S/C9H21O5PSi/c1-12-15(11,13-2)8-9(10)14-6-7-16(3,4)5/h6-8H2,1-5H3
charge 0 multiplicity 1
37 atoms
P  2.210551 -0.751004 1.675029
Si -4.109428 -0.228056 -0.621017
O  -0.502133 1.347011 1.025719
O  2.054004 -1.765618 0.276183
O  3.927955 -0.548909 1.925166
O  0.616385 1.030074 -1.002505
O  1.40235 -1.342982 2.904777
C  -2.33247 -0.106331 0.135048
C  -4.548178 -2.083303 -0.781626
C  -5.359045 0.644955 0.540947
C  -4.137252 0.606473 -2.345874
C  -1.833742 1.326446 0.31113
C  1.856097 1.02227 1.121222
C  0.621458 1.132205 0.249023
C  2.846754 -1.476027 -0.946577
C  4.611047 -1.500532 2.833145
H  -1.639148 -0.665263 -0.522235
H  -2.336444 -0.618549 1.11672
H  -3.834092 -2.604249 -1.445672
H  -4.522686 -2.585547 0.202916
H  -5.561857 -2.214328 -1.203626
H  -6.39149 0.527859 0.162302
H  -5.323201 0.214669 1.5590
H  -5.155425 1.729032 0.622057
H  -3.925181 1.690063 -2.280597
H  -3.384412 0.154849 -3.018071
H  -5.129048 0.487832 -2.820534
H  -2.473762 1.919987 0.983462
H  -1.704355 1.843448 -0.656551
H  2.743294 1.349911 0.558824
H  1.746417 1.608155 2.046451
H  3.920915 -1.376945 -0.705901
H  2.46721 -0.565435 -1.442961
H  2.683621 -2.351508 -1.592648
H  4.782103 -2.46692 2.325859
H  4.015262 -1.659639 3.749511
H  5.572328 -1.023592 3.076004
