program: Gaussian 09
title: 000187724
version: EM64L-G09RevD.01
frameworkgroup: C1[X(C18H21NO3S)]
method: RPBEPBE
basis: SDD
operation: Freq
keyword: #p
keyword: freq=noraman
keyword: PBEPBE/SDD
title: #p freq=noraman PBEPBE/SDD
converged: YES YES NO NO
title: Mulliken charges:
elementType: S O O O N C C C C C C C C C C C C C C C C C C H H H H H H H H H H H H H H H H H H H H H
charge: 0.872223 -0.291162 -0.536975 -0.530952 -0.281985 -0.014463 -0.423688 -0.356839 -0.260115 0.496322 -0.728467 -0.179828 0.492753 -0.416283 -0.332724 -0.218390 -0.399021 -0.807019 -0.238299 -0.256728 -0.244193 -0.213842 -0.239354 0.249091 0.219280 0.296791 0.222226 0.218441 0.234226 0.223779 0.230882 0.265764 0.233700 0.247235 0.309025 0.239085 0.278127 0.215004 0.273790 0.224858 0.227005 0.241022 0.231251 0.228447
chargesum: 0.00000
title: Mulliken charges with hydrogens summed into heavy atoms:
elementType: S O O O N C C C C C C C C C C C C C C C C C C
charge: 0.872223 -0.291162 -0.536975 -0.530952 -0.281985 0.234627 0.092383 0.083827 -0.025888 0.496322 -0.008042 -0.179828 0.492753 -0.182583 -0.085489 0.090634 -0.159936 -0.040098 -0.013440 -0.029723 -0.003171 0.017408 -0.010907
polarizability: 2.75114128e+02 1.39956884e+01 2.32166092e+02 3.21164618e+00 -1.64785311e+01 1.85275634e+02
1716.lowfreq: -12.6703 -0.0019 0.0003 0.0012 1.7221 9.7157 15.3078 31.2518 39.5090
frequency: 12.8068 31.0053 39.4560 47.6723 51.8859 64.9041 71.2371 82.6700 125.1614 145.6831 149.3867 160.8404 190.8002 202.7948 213.5952 223.5629 234.6234 255.6466 260.6441 263.4285 278.9967 290.0462 344.7731 376.3078 389.0689 401.3400 404.7045 418.7454 438.9326 450.6041 473.3210 514.9753 521.7414 534.8612 569.5375 614.9909 626.8459 644.5096 688.2760 700.0042 702.6237 739.8022 763.6103 783.9449 788.5229 799.6115 807.6870 811.0224 850.0908 868.7640 879.9329 915.2270 921.7824 938.0421 955.8786 974.2620 982.4925 986.8548 992.1072 992.8728 995.0124 995.0771 1003.2752 1026.6420 1038.2702 1044.5440 1048.4652 1059.7731 1073.7343 1092.3357 1108.0633 1112.8977 1133.0548 1136.4464 1172.3813 1173.8426 1194.5797 1216.4690 1221.7518 1229.5858 1249.2693 1278.5336 1289.2075 1292.4515 1317.9237 1340.1710 1367.6241 1385.3937 1391.0909 1395.5174 1405.8458 1421.8134 1437.8329 1441.7787 1460.6122 1461.7481 1468.7506 1480.3832 1482.6722 1486.8616 1496.4249 1569.1390 1593.7957 1608.1831 1614.3415 2939.2516 2951.4012 2992.0347 2992.9108 3013.8392 3063.0084 3077.3702 3083.1929 3101.1913 3103.2104 3109.1347 3113.3241 3126.4950 3129.0950 3140.2438 3146.7951 3157.4251 3162.3863 3168.7331 3177.0092 3178.2280
redmass: 4.4168 5.9413 4.4436 4.1299 5.0885 4.6925 3.9903 5.5322 1.2880 3.7657 4.5110 5.0255 3.4318 5.1397 3.8942 3.9931 4.9958 3.3008 3.0686 4.1304 3.3580 1.5613 3.9050 6.9023 4.3486 2.8083 2.2168 3.7862 4.6955 3.3838 4.3114 3.4587 4.2042 5.4870 4.2395 5.8833 3.6919 6.7913 5.4756 1.8213 3.0136 2.7369 1.2428 2.4459 5.4476 8.6344 2.5528 3.9031 1.2522 1.2915 2.1067 4.6903 1.6626 1.6534 1.3788 1.3985 3.4153 4.5746 2.5359 1.4839 1.8392 1.7268 1.8931 1.8878 1.5372 2.1205 1.5479 2.2303 1.7111 1.7454 1.4337 1.8175 1.4816 1.6027 1.0533 1.0610 1.1165 2.5053 1.9831 1.4436 1.2672 1.4753 1.2358 1.6351 1.2801 1.2768 5.0243 6.1121 1.8415 1.2530 1.2494 2.2028 1.5501 1.3311 1.0495 2.4975 1.0555 1.1255 1.1916 2.0993 1.0671 5.3772 6.0097 7.2212 5.9712 1.0649 1.0805 1.0362 1.0372 1.0962 1.0530 1.0960 1.0995 1.1003 1.1001 1.0914 1.0868 1.0873 1.0868 1.0932 1.0914 1.0986 1.0941 1.1183 1.0959 1.0984
irintensity: 0.7196 0.6353 0.3039 3.2701 0.6071 3.2239 0.5499 2.3842 1.4157 2.8695 1.6654 1.2711 3.1634 1.2505 1.2624 3.7452 3.9089 4.3129 0.8092 6.9686 2.2297 1.5503 5.7359 13.5864 3.2872 0.1282 1.8851 20.1765 37.1070 20.5589 29.5830 26.2855 19.1435 17.7277 25.3745 0.1988 0.2068 3.1123 4.5051 45.7450 16.0625 73.2107 73.5392 23.3360 13.0593 45.3034 14.7402 20.5923 0.8621 0.0183 0.2180 74.6351 12.8487 8.4651 0.6085 0.6078 1.0663 14.8332 4.6154 1.2097 2.4031 6.4748 4.6944 10.7293 0.3020 5.4718 12.3840 33.0053 7.2310 2.7036 3.8943 16.1802 3.2942 2.0128 0.0934 2.0200 1.6942 13.9834 12.8387 12.1994 8.1441 8.0531 9.4920 28.1754 1.0206 1.8487 10.6307 1.2925 10.5806 27.9810 19.1700 2.3980 16.8496 20.4944 17.9840 22.5311 8.2626 33.3137 2.1999 9.9502 1.3836 0.8644 1.0883 3.5790 1.2467 16.6503 24.4953 26.3482 6.9961 11.3880 35.9697 7.4393 31.3565 12.6028 7.3758 8.3577 7.3272 2.1885 3.5769 29.6094 18.2390 35.3352 12.0747 24.8868 4.5031 20.0425
temp: 298.150 k
press: 1.00000 atm
elementType: 16 8 8 8 7 6 6 6 6 6 6 6 6 6 6 6 6 6 6 6 6 6 6 1 1 1 1 1 1 1 1 1 1 1 1 1 1 1 1 1 1 1 1 1
symmnumber: 1
zpe: 913380.9 jmol-1
zpe.correction: 0.347888 hartree
zpe.thermalcorrener: 0.371137 hartree
zpe.thermalcorrenthalpy: 0.372082 hartree
zpe.thermalcorrgfe: 0.293640 hartree
zpe.sumelectzpe: -1375.068154 hartree
zpe.sumelectthermal: -1375.044905 hartree
zpe.sumelectthermalent: -1375.043961 hartree
zpe.sumelectthermalfe: -1375.122402 hartree
dipole: 0.4414 -0.9711 -4.7842
dipole: 4.9016
quadrupole: -137.0666 -123.4793 -148.8174
quadrupole: 0.3124 4.1289 2.1311
quadrupole: -0.6122 12.9751 -12.3630 0.3124 4.1289 2.1311
hfenergy: -1375.4160426 hartree
pointgroup: C01 [X(C18H21N1O3S1)]
dipole: 0.4534404 1.2200711 1.4229357 debye
polarizability: 264.9186269|-27.7818869|215.3712456|-1.5255164|-29.1512432|212.2659813 unknown
InChI: InChI=1S/C18H21NO3S/c1-14-8-6-7-11-18(14)23(20,21)19(12-17-13-22-17)15(2)16-9-4-3-5-10-16/h3-11,15,17H,12-13H2,1-2H3
charge 0 multiplicity 1
44 atoms
S  -0.670057 -0.333983 -1.372533
O  -2.603567 2.646355 0.054666
O  0.301594 -1.605176 -1.680744
O  -1.518861 0.304964 -2.62039
N  0.413156 1.119175 -0.562325
C  -1.122991 2.958683 0.13502
C  -0.237701 2.41211 -0.968338
C  -2.104226 4.05372 -0.157051
C  1.875682 1.027288 -0.992597
C  2.647828 0.012019 -0.14341
C  2.103541 0.929095 -2.519275
C  -1.926894 -0.773647 -0.015367
C  -1.545906 -1.539297 1.113455
C  2.903959 0.330949 1.215961
C  3.147293 -1.208025 -0.658713
C  -3.229863 -0.319559 -0.27585
C  -2.603201 -1.850998 2.011026
C  -0.13496 -2.011275 1.393605
C  3.63659 -0.54629 2.045128
C  3.884248 -2.087504 0.165905
C  -4.248503 -0.653241 0.64241
C  -3.929792 -1.421081 1.784048
C  4.13142 -1.762985 1.519526
H  -0.722431 2.861877 1.152272
H  0.563078 3.148511 -1.179482
H  -0.831204 2.296302 -1.901405
H  -2.370885 4.76658 0.632579
H  -2.204678 4.422328 -1.186621
H  2.247434 2.023007 -0.667081
H  3.178379 1.036252 -2.750898
H  1.556941 1.732644 -3.044459
H  1.752769 -0.036154 -2.919353
H  2.521317 1.274432 1.625623
H  2.945634 -1.484771 -1.696775
H  -3.429222 0.279898 -1.168254
H  -2.367145 -2.445155 2.901307
H  0.259676 -2.618227 0.5611
H  -0.105291 -2.607926 2.320222
H  0.557271 -1.157747 1.50996
H  3.825904 -0.281007 3.091505
H  4.259726 -3.030083 -0.248095
H  -5.271653 -0.307442 0.466379
H  -4.713955 -1.686272 2.501829
H  4.704545 -2.446846 2.15589
