program: Gaussian 09
title: 000187726
version: EM64L-G09RevD.01
frameworkgroup: C1[X(C19H21NO5S)]
method: RPBEPBE
basis: SDD
operation: Freq
keyword: #p
keyword: freq=noraman
keyword: PBEPBE/SDD
title: #p freq=noraman PBEPBE/SDD
converged: YES YES NO NO
title: Mulliken charges:
elementType: S O O O O O N C C C C C C C C C C C C C C C C C C C H H H H H H H H H H H H H H H H H H H H H
charge: 0.916319 -0.310182 -0.544538 -0.518979 -0.256331 -0.232944 -0.361756 0.012988 -0.410906 -0.360948 -0.219632 0.513329 -0.738375 -0.124963 -0.447987 -0.405152 0.312368 -0.206947 -0.222822 -0.238694 -0.358428 -0.240658 -0.239410 -0.215643 0.163261 -0.500214 0.237669 0.235954 0.282288 0.230554 0.225962 0.231373 0.273188 0.233388 0.231709 0.221506 0.308002 0.334658 0.226232 0.228576 0.273825 0.249627 0.229023 0.241607 0.243007 0.237915 0.261184
chargesum: 0.00000
title: Mulliken charges with hydrogens summed into heavy atoms:
elementType: S O O O O O N C C C C C C C C C C C C C C C C C C C
charge: 0.916319 -0.310182 -0.544538 -0.518979 -0.256331 -0.232944 -0.361756 0.250657 0.107336 0.095568 0.011741 0.513329 -0.000091 -0.124963 -0.226481 -0.097151 0.312368 0.127711 0.003410 -0.010119 -0.084602 0.008969 -0.010387 0.025964 0.163261 0.241891
polarizability: 3.03087356e+02 2.02274337e+00 2.65764379e+02 -2.18524872e+01 -2.19921237e+01 1.90174362e+02
1716.lowfreq: -4.9249 -1.6154 -0.0007 -0.0005 -0.0004 5.7996 24.0464 25.5426 33.9948
frequency: 23.9848 25.5099 33.9041 42.9064 48.9051 57.0479 65.6066 73.8812 80.6915 82.9971 91.7098 109.0882 132.1541 147.5494 163.4683 184.3180 197.2758 215.9779 230.0739 245.2261 252.3471 255.9987 266.8910 276.9461 290.8636 300.2971 323.8215 345.6378 362.3950 386.6420 406.9846 425.6342 426.8548 466.1510 477.5004 493.3976 535.8494 537.3756 579.9032 611.8255 621.9904 630.7940 670.1339 676.3519 693.9744 713.3674 736.6226 741.0756 771.1643 776.5919 787.0361 790.2347 804.6207 826.6625 865.2672 883.0210 895.9353 913.4774 917.4269 935.2935 944.5725 974.3961 986.5573 987.0817 990.9204 998.2574 1005.3640 1015.8410 1024.9158 1029.7503 1035.0838 1045.3432 1072.8708 1089.5428 1094.1414 1098.5831 1113.8779 1116.5967 1122.4983 1127.7912 1147.0303 1157.8034 1173.0398 1178.5347 1198.9696 1208.7890 1236.4604 1245.8722 1268.3226 1275.8104 1285.4448 1310.7607 1334.5252 1346.8933 1374.6059 1383.2999 1389.4487 1394.0960 1413.5511 1422.3002 1442.9396 1450.5910 1456.3843 1459.8884 1468.0590 1469.8489 1477.2965 1482.4205 1490.6851 1563.9602 1591.0713 1599.7385 1610.8250 1633.6913 2935.6472 2957.2986 2996.8595 3008.6255 3029.1528 3067.7837 3089.3642 3091.3713 3103.8147 3115.0303 3117.3030 3120.7514 3130.8837 3142.1447 3143.1127 3152.9532 3155.9306 3161.4301 3161.9938 3174.3988 3177.0236
redmass: 7.0220 5.5128 5.5438 4.4275 5.2308 4.3393 4.7612 1.4947 3.5482 2.6465 4.1262 4.7312 5.2090 5.1825 5.2819 3.9048 6.7473 3.7980 6.3000 5.6017 3.7553 5.0061 3.8945 1.4639 4.0755 4.0969 4.6880 6.2198 3.5145 5.7816 2.8801 5.6635 3.0188 4.4672 5.2468 5.2356 4.0403 3.8499 3.8930 5.1878 4.9118 6.3101 6.9651 5.6738 5.9495 1.7518 3.2481 3.6746 3.8172 2.0372 1.5928 11.6913 2.6098 3.6730 1.2567 2.2444 1.4273 7.4336 8.7411 1.3953 1.5588 1.4111 2.2803 1.8180 6.6599 2.3471 1.3582 1.3199 1.2777 2.0370 2.8358 3.1973 1.6815 1.7772 2.3032 1.5627 1.5871 1.3841 1.4910 3.1344 1.9921 1.5111 1.0584 1.0692 1.1527 2.1385 1.6168 2.6597 1.1739 1.6460 1.6066 1.2620 1.3380 1.2418 7.4257 4.9144 1.6759 1.3043 1.2111 2.1334 2.1218 1.0620 2.3428 1.0751 1.0521 1.0623 1.1779 1.9317 1.0937 5.9441 5.9002 6.9616 5.7794 10.6206 1.0829 1.0614 1.0363 1.0287 1.0979 1.0527 1.0912 1.0995 1.0880 1.1000 1.1052 1.0884 1.0905 1.0864 1.0952 1.0906 1.1050 1.1012 1.0951 1.1009 1.1193
irintensity: 0.3357 0.3764 0.2687 0.2691 2.5283 0.8109 5.2607 0.7946 1.8462 0.9582 1.3725 1.4546 1.5025 1.4895 8.2910 0.5832 3.4431 4.4547 7.3981 2.1793 8.8205 7.3216 7.6510 6.8964 6.3450 3.7621 1.5774 3.1540 2.8206 24.9501 1.6479 3.3465 26.1047 43.9609 42.8037 72.5526 12.5175 9.0632 20.0550 17.7126 13.7422 19.2923 3.9638 34.4667 12.6074 51.2837 9.9804 13.2447 30.2304 30.6771 39.5323 63.6356 5.2188 65.3561 0.1192 6.1895 0.5397 35.0085 60.3187 4.2688 5.8450 3.0114 0.6624 0.7279 10.2859 6.5232 0.0678 2.5868 1.3959 7.4859 30.5874 34.4481 27.0058 9.8210 59.9483 18.0280 8.8788 18.9706 22.5736 22.3598 3.4840 22.6995 0.1759 1.0160 0.6830 22.8478 6.0088 152.0382 6.6544 39.9168 47.1207 16.0946 1.6930 3.7079 3.6079 2.7840 9.7643 12.9785 38.2491 24.5871 15.0922 14.9643 2.0149 14.3382 9.3190 12.6675 3.9130 14.6661 18.4882 3.5608 1.6089 13.2991 3.1809 210.4732 13.5129 45.6249 19.6194 29.4734 7.6294 32.0713 17.8191 34.9734 12.2063 5.4979 16.9488 13.5915 7.3159 10.2266 23.9071 20.0758 9.5824 46.3933 4.5840 27.4232 22.2619
temp: 298.150 k
press: 1.00000 atm
elementType: 16 8 8 8 8 8 7 6 6 6 6 6 6 6 6 6 6 6 6 6 6 6 6 6 6 6 1 1 1 1 1 1 1 1 1 1 1 1 1 1 1 1 1 1 1 1 1
symmnumber: 1
zpe: 949694.1 jmol-1
zpe.correction: 0.361719 hartree
zpe.thermalcorrener: 0.388127 hartree
zpe.thermalcorrenthalpy: 0.389072 hartree
zpe.thermalcorrgfe: 0.303086 hartree
zpe.sumelectzpe: -1563.398947 hartree
zpe.sumelectthermal: -1563.372539 hartree
zpe.sumelectthermalent: -1563.371594 hartree
zpe.sumelectthermalfe: -1563.457581 hartree
dipole: -2.7184 3.4108 -0.9652
dipole: 4.4671
quadrupole: -140.3020 -151.9723 -160.7641
quadrupole: 0.6862 -3.0198 -9.9639
quadrupole: 10.7108 -0.9595 -9.7513 0.6862 -3.0198 -9.9639
hfenergy: -1563.7606661 hartree
pointgroup: C01 [X(C19H21N1O5S1)]
dipole: 0.2669555 -1.7292747 -0.1648652 debye
polarizability: 297.8548484|-10.986045|273.8070288|27.7963588|-2.1998581|187.3642199 unknown
InChI: InChI=1S/C19H21NO5S/c1-14(15-8-4-3-5-9-15)20(12-16-13-25-16)26(22,23)18-11-7-6-10-17(18)19(21)24-2/h3-11,14,16H,12-13H2,1-2H3
charge 0 multiplicity 1
47 atoms
S  -0.401492 0.680746 0.592443
O  -1.230786 -3.468625 1.087999
O  0.41671 1.940731 -0.057862
O  -0.56735 0.585889 2.210442
O  -1.915788 3.247265 0.846493
O  -2.3725 4.053982 -1.302782
N  0.319759 -1.00986 0.044498
C  0.265038 -3.249562 1.042743
C  0.734338 -1.814281 1.220275
C  -0.342069 -4.01136 2.182244
C  1.230224 -1.051173 -1.15444
C  2.719781 -0.801418 -0.869261
C  0.692043 -0.212371 -2.335661
C  -2.120149 0.551204 -0.253099
C  3.648047 -1.8524 -1.081948
C  3.200401 0.455042 -0.415615
C  -2.77198 1.710646 -0.728543
C  -2.649622 -0.740973 -0.400371
C  5.03052 -1.659431 -0.855434
C  4.580444 0.647118 -0.184978
C  -3.970882 1.530993 -1.465111
C  -3.873729 -0.886708 -1.095198
C  5.500578 -0.405669 -0.404037
C  -4.51855 0.243841 -1.64678
C  -2.315895 3.117762 -0.473748
C  -1.245545 4.514031 1.22088
H  0.74764 -3.825684 0.24101
H  1.834337 -1.800402 1.371323
H  0.264004 -1.373371 2.119532
H  -0.459567 -3.512552 3.152285
H  -0.262532 -5.104766 2.209699
H  1.137908 -2.115295 -1.466483
H  0.780522 0.869029 -2.146918
H  -0.366812 -0.457269 -2.53244
H  1.27803 -0.45282 -3.239408
H  3.288867 -2.828111 -1.436723
H  2.491342 1.273444 -0.242952
H  -2.117328 -1.611518 -0.005131
H  5.734043 -2.481833 -1.028038
H  4.939118 1.621553 0.165751
H  -4.464847 2.420453 -1.869398
H  -4.305171 -1.885995 -1.211987
H  6.570374 -0.250095 -0.224345
H  -5.45131 0.125096 -2.207724
H  -1.790312 5.375915 0.801741
H  -1.251402 4.523609 2.319094
H  -0.21465 4.481598 0.831364
